{"text_format":"1","workbook":"xlsx","n_sheets":29,"sheets":["VR Gruppeneinteilung","VR Gruppe A","VR Gruppe B","VR Gruppe C","VR Gruppe D","VR Gruppe E","ZR Gruppeneinteilung","ZR Gruppe A","ZR Gruppe B","Endrunde","GR Platzierungsspiele VR","11 - 15","16 - 20","21 -25","26 -30","Platzierungen gesamt","Lauf VRGA","Lauf VRGB","Lauf VRGC","Lauf VRGD","Lauf VRGE","Lauf ZR1","Lauf ZR2","Lauf Endrunde","Lauf11-15","Lauf16-20","Lauf21-25","Lauf26 -30","Elfmeter"],"not_rendered":{"charts":0,"images":11,"macros":1,"external_links":0,"defined_names":5,"comments":0,"pivot_tables":0},"unopened":[],"bounds":{"document_bytes":16777216,"sheet_cells":100000,"rows_first":2000,"rows_last":500,"rows_between":2000,"halvings":0,"cell_chars":16384,"cell_head_chars":4096},"cells_cut":0,"cells_raw":0,"read":"whole","date_system":"1900"}

{"sheet":"VR Gruppeneinteilung","index":0,"n_rows":47,"n_cols":12,"rows_kept":47,"cut":false,"hidden":false,"merged":[[19,0,19,1],[1,11,5,12],[1,0,1,1],[1,4,1,5],[10,0,10,1],[10,4,10,5]]}
[null,null,null,null,null,null,null,"Team",null,"Name"]
["Gruppe A",null,"Platz",null,"Gruppe B",null,"Platz",{"$f":"B3","v":"BW Papenburg"},{"$f":"IF(J2=\"\",$I$47,$L$2 & \"\" & J2 & \"\" & $L$7)","v":"E:\\Veenhusen\\E_Turnier_und_Sportwoche\\2012\\Mannschaftsbilder_Urkunde\\1.jpg"},1,"Speicherort:","E:\\Veenhusen\\E_Turnier_und_Sportwoche\\2012\\Mannschaftsbilder_Urkunde\\"]
["1.","BW Papenburg",1,null,"1.","Frisia Loga",2,{"$f":"B4","v":"TuS Eversten E5"},"E:\\Veenhusen\\E_Turnier_und_Sportwoche\\2012\\Mannschaftsbilder_Urkunde\\2.jpg",2]
["2.","TuS Eversten E5",1,null,"2.","\"Fortuna\" Veenhusen E-Mädchen",2,"Borussia Salchendorf","E:\\Veenhusen\\E_Turnier_und_Sportwoche\\2012\\Mannschaftsbilder_Urkunde\\3.jpg",3]
["3.","Borussia Salchendorf",1,null,"3.","TuS  Hasbergen",2,"VfL Viktoria Flachsmeer","E:\\Veenhusen\\E_Turnier_und_Sportwoche\\2012\\Mannschaftsbilder_Urkunde\\4.jpg",4]
["4.","VfL Viktoria Flachsmeer",1,null,"4.","FSV Westerstede",2,"VfL \"Fortuna\" Veenhusen 3","E:\\Veenhusen\\E_Turnier_und_Sportwoche\\2012\\Mannschaftsbilder_Urkunde\\66.jpg",66]
["5.","VfL \"Fortuna\" Veenhusen 3",1,null,"5.","JSG Riede/Emtinghausen 1",2,"JSG Kloster Oesede/Harderberg","E:\\Veenhusen\\E_Turnier_und_Sportwoche\\2012\\Mannschaftsbilder_Urkunde\\66.jpg",66,"Endung:",".jpg"]
["6.","JSG Kloster Oesede/Harderberg",1,null,"6.","SV Warsingsfehn 3",2,{"$f":"F3","v":"Frisia Loga"},"E:\\Veenhusen\\E_Turnier_und_Sportwoche\\2012\\Mannschaftsbilder_Urkunde\\66.jpg",66,"Kein Bild:","kein_bild"]
[null,null,null,null,null,null,null,{"$f":"F4","v":"\"Fortuna\" Veenhusen E-Mädchen"},"E:\\Veenhusen\\E_Turnier_und_Sportwoche\\2012\\Mannschaftsbilder_Urkunde\\66.jpg",66]
[null,null,null,null,null,null,null,"TuS  Hasbergen","E:\\Veenhusen\\E_Turnier_und_Sportwoche\\2012\\Mannschaftsbilder_Urkunde\\66.jpg",66]
["Gruppe C",null,"Platz",null,"Gruppe D",null,"Platz","FSV Westerstede","E:\\Veenhusen\\E_Turnier_und_Sportwoche\\2012\\Mannschaftsbilder_Urkunde\\66.jpg",66]
["1.","VfL \"Fortuna\" Veenhusen 1",3,null,"1.","VfL Germania Leer",4,"JSG Riede/Emtinghausen 1","E:\\Veenhusen\\E_Turnier_und_Sportwoche\\2012\\Mannschaftsbilder_Urkunde\\66.jpg",66]
["2.","TV Jahn Delmenhorst",3,null,"2.","SV Großefehn",4,"SV Warsingsfehn 3","E:\\Veenhusen\\E_Turnier_und_Sportwoche\\2012\\Mannschaftsbilder_Urkunde\\66.jpg",66]
["3.","JSG Riede/Emtinghausen 2",3,null,"3.","VfL \"Fortuna\" Veenhusen 2",4,{"$f":"B12","v":"VfL \"Fortuna\" Veenhusen 1"},"E:\\Veenhusen\\E_Turnier_und_Sportwoche\\2012\\Mannschaftsbilder_Urkunde\\kein_bild.jpg"]
["4.","TuS Holthusen",3,null,"4.","TuS Strudden 2",4,{"$f":"B13","v":"TV Jahn Delmenhorst"},"E:\\Veenhusen\\E_Turnier_und_Sportwoche\\2012\\Mannschaftsbilder_Urkunde\\kein_bild.jpg"]
["5.","TuS Strudden 1",3,null,"5.","TSV Barrien",4,"JSG Riede/Emtinghausen 2","E:\\Veenhusen\\E_Turnier_und_Sportwoche\\2012\\Mannschaftsbilder_Urkunde\\kein_bild.jpg"]
["6.","BW Galgenmoor",3,null,"6.","TuS Weener",4,"TuS Holthusen","E:\\Veenhusen\\E_Turnier_und_Sportwoche\\2012\\Mannschaftsbilder_Urkunde\\kein_bild.jpg"]
[null,null,null,null,null,null,null,"TuS Strudden 1","E:\\Veenhusen\\E_Turnier_und_Sportwoche\\2012\\Mannschaftsbilder_Urkunde\\kein_bild.jpg"]
[null,null,null,null,null,null,null,{"$f":"B17","v":"BW Galgenmoor"},"E:\\Veenhusen\\E_Turnier_und_Sportwoche\\2012\\Mannschaftsbilder_Urkunde\\kein_bild.jpg"]
["Gruppe E",null,"Platz",null,null,null,null,{"$f":"F12","v":"VfL Germania Leer"},"E:\\Veenhusen\\E_Turnier_und_Sportwoche\\2012\\Mannschaftsbilder_Urkunde\\kein_bild.jpg"]
["1.","Weiße Elf Nordhorn",5,null,null,null,null,{"$f":"F13","v":"SV Großefehn"},"E:\\Veenhusen\\E_Turnier_und_Sportwoche\\2012\\Mannschaftsbilder_Urkunde\\kein_bild.jpg"]
["2.","SV Wallinghausen",5,null,null,null,null,"VfL \"Fortuna\" Veenhusen 2","E:\\Veenhusen\\E_Turnier_und_Sportwoche\\2012\\Mannschaftsbilder_Urkunde\\kein_bild.jpg"]
["3.","SF Oesede",5,null,null,null,null,"TuS Strudden 2","E:\\Veenhusen\\E_Turnier_und_Sportwoche\\2012\\Mannschaftsbilder_Urkunde\\kein_bild.jpg"]
["4.","SV Spetzerfehn",5,null,null,null,null,"TSV Barrien","E:\\Veenhusen\\E_Turnier_und_Sportwoche\\2012\\Mannschaftsbilder_Urkunde\\kein_bild.jpg"]
["5.","SV Concordia Neermoor",5,null,null,null,null,"TuS Weener","E:\\Veenhusen\\E_Turnier_und_Sportwoche\\2012\\Mannschaftsbilder_Urkunde\\kein_bild.jpg"]
["6.","TV Apen",5,null,null,null,null,{"$f":"B21","v":"Weiße Elf Nordhorn"},"E:\\Veenhusen\\E_Turnier_und_Sportwoche\\2012\\Mannschaftsbilder_Urkunde\\kein_bild.jpg"]
[null,null,null,null,null,null,null,{"$f":"B22","v":"SV Wallinghausen"},"E:\\Veenhusen\\E_Turnier_und_Sportwoche\\2012\\Mannschaftsbilder_Urkunde\\kein_bild.jpg"]
[null,null,null,null,null,null,null,"SF Oesede","E:\\Veenhusen\\E_Turnier_und_Sportwoche\\2012\\Mannschaftsbilder_Urkunde\\kein_bild.jpg"]
[null,null,null,null,null,null,null,"SV Spetzerfehn","E:\\Veenhusen\\E_Turnier_und_Sportwoche\\2012\\Mannschaftsbilder_Urkunde\\kein_bild.jpg"]
[null,null,null,null,null,null,null,"SV Concordia Neermoor","E:\\Veenhusen\\E_Turnier_und_Sportwoche\\2012\\Mannschaftsbilder_Urkunde\\kein_bild.jpg"]
[null,null,null,null,null,null,null,{"$f":"B26","v":"TV Apen"},"E:\\Veenhusen\\E_Turnier_und_Sportwoche\\2012\\Mannschaftsbilder_Urkunde\\kein_bild.jpg"]
[]
[]
[]
[]
[]
[]
[]
[]
[]
[]
[]
[]
[]
[]
[null,null,null,null,null,null,null,null,"No Image"]
[null,null,null,null,null,null,null,null,{"$f":"$L$2&\"\"&L8&\"\"&$L$7","v":"E:\\Veenhusen\\E_Turnier_und_Sportwoche\\2012\\Mannschaftsbilder_Urkunde\\kein_bild.jpg"}]

{"sheet":"VR Gruppe A","index":1,"n_rows":45,"n_cols":71,"rows_kept":45,"cut":false,"hidden":false,"merged":[[4,7,4,11],[4,20,4,21],[4,23,4,27],[4,37,4,41],[13,14,13,15],[13,16,13,40],[14,14,14,15],[14,16,14,40],[1,0,1,54],[2,0,2,54],[15,14,15,15],[15,16,15,40],[9,14,9,40],[10,14,10,15],[10,16,10,40],[11,14,11,15],[11,16,11,40],[12,14,12,15],[12,16,12,40],[19,1,19,2],[19,3,19,7],[19,8,19,47],[19,48,19,52],[19,53,19,54],[20,1,20,2],[20,3,20,7],[20,8,20,26],[20,28,20,47],[20,48,20,49],[20,51,20,52],[20,53,20,54],[21,1,21,2],[21,3,21,7],[21,8,21,26],[21,28,21,47],[21,48,21,49],[21,51,21,52],[21,53,21,54],[22,53,22,54],[23,1,23,2],[23,3,23,7],[23,8,23,26],[23,28,23,47],[23,48,23,49],[23,51,23,52],[23,53,23,54],[22,1,22,2],[22,3,22,7],[22,8,22,26],[22,28,22,47],[22,48,22,49],[22,51,22,52],[24,53,24,54],[25,1,25,2],[25,3,25,7],[25,8,25,26],[25,28,25,47],[25,48,25,49],[25,51,25,52],[25,53,25,54],[24,1,24,2],[24,3,24,7],[24,8,24,26],[24,28,24,47],[24,48,24,49],[24,51,24,52],[26,53,26,54],[27,1,27,2],[27,3,27,7],[27,8,27,26],[27,28,27,47],[27,48,27,49],[27,51,27,52],[27,53,27,54],[26,1,26,2],[26,3,26,7],[26,8,26,26],[26,28,26,47],[26,48,26,49],[26,51,26,52],[28,53,28,54],[29,1,29,2],[29,3,29,7],[29,8,29,26],[29,28,29,47],[29,48,29,49],[29,51,29,52],[29,53,29,54],[28,1,28,2],[28,3,28,7],[28,8,28,26],[28,28,28,47],[28,48,28,49],[28,51,28,52],[30,53,30,54],[31,1,31,2],[31,3,31,7],[31,8,31,26],[31,28,31,47],[31,48,31,49],[31,51,31,52],[31,53,31,54],[30,1,30,2],[30,3,30,7],[30,8,30,26],[30,28,30,47],[30,48,30,49],[30,51,30,52],[32,53,32,54],[33,1,33,2],[33,3,33,7],[33,8,33,26],[33,28,33,47],[33,48,33,49],[33,51,33,52],[33,53,33,54],[32,1,32,2],[32,3,32,7],[32,8,32,26],[32,28,32,47],[32,48,32,49],[32,51,32,52],[34,53,34,54],[38,8,38,33],[38,34,38,36],[38,37,38,39],[38,40,38,44],[38,45,38,47],[34,1,34,2],[34,3,34,7],[34,8,34,26],[34,28,34,47],[34,48,34,49],[34,51,34,52],[39,45,39,47],[40,8,40,9],[40,10,40,33],[40,34,40,36],[40,37,40,39],[40,40,40,41],[40,43,40,44],[40,45,40,47],[39,8,39,9],[39,10,39,33],[39,34,39,36],[39,37,39,39],[39,40,39,41],[39,43,39,44],[41,45,41,47],[42,8,42,9],[42,10,42,33],[42,34,42,36],[42,37,42,39],[42,40,42,41],[42,43,42,44],[42,45,42,47],[41,8,41,9],[41,10,41,33],[41,34,41,36],[41,37,41,39],[41,40,41,41],[41,43,41,44],[43,45,43,47],[44,8,44,9],[44,10,44,33],[44,34,44,36],[44,37,44,39],[44,40,44,41],[44,43,44,44],[44,45,44,47],[43,8,43,9],[43,10,43,33],[43,34,43,36],[43,37,43,39],[43,40,43,41],[43,43,43,44]]}
[]
["Vorrunde"]
["Gruppe A"]
[]
[null,null,null,null,null,null,"Beginn:","14:00:00",null,null,null,null,"Uhr",null,null,null,null,null,null,"Spielzeit:",1,null,"x","00:15:00",null,null,null,null,"min",null,null,null,null,null,null,null,"Pause:","00:02:00",null,null,null,null,"min"]
[]
[]
[null,"I. Teilnehmende Mannschaften"]
[]
[null,null,null,null,null,null,null,null,null,null,null,null,null,null,"Gruppeneinteilung"]
[null,null,null,null,null,null,null,null,null,null,null,null,null,null,"1.",null,{"$f":"'VR Gruppeneinteilung'!B3","v":"BW Papenburg"}]
[null,null,null,null,null,null,null,null,null,null,null,null,null,null,"2.",null,{"$f":"'VR Gruppeneinteilung'!B4","v":"TuS Eversten E5"}]
[null,null,null,null,null,null,null,null,null,null,null,null,null,null,"3.",null,{"$f":"'VR Gruppeneinteilung'!B5","v":"Borussia Salchendorf"}]
[null,null,null,null,null,null,null,null,null,null,null,null,null,null,"4.",null,{"$f":"'VR Gruppeneinteilung'!B6","v":"VfL Viktoria Flachsmeer"}]
[null,null,null,null,null,null,null,null,null,null,null,null,null,null,"5.",null,{"$f":"'VR Gruppeneinteilung'!B7","v":"VfL \"Fortuna\" Veenhusen 3"}]
[null,null,null,null,null,null,null,null,null,null,null,null,null,null,"6.",null,{"$f":"'VR Gruppeneinteilung'!B8","v":"JSG Kloster Oesede/Harderberg"}]
[]
[null,"II. Spielplan"]
[]
[null,"Nr.",null,"Beginn",null,null,null,null,"Spielpaarung",null,null,null,null,null,null,null,null,null,null,null,null,null,null,null,null,null,null,null,null,null,null,null,null,null,null,null,null,null,null,null,null,null,null,null,null,null,null,null,"Ergebnis",null,null,null,null,null,null,null,null,"Punkte"]
[null,1,null,{"$f":"$H$5","v":"14:00:00"},null,null,null,null,{"$f":"$Q$11","v":"BW Papenburg"},null,null,null,null,null,null,null,null,null,null,null,null,null,null,null,null,null,null,"-",{"$f":"$Q$12","v":"TuS Eversten E5"},null,null,null,null,null,null,null,null,null,null,null,null,null,null,null,null,null,null,null,6,null,":",0,null,null,null,null,null,{"$f":"IF(ISBLANK(AW21),\"0\",IF(AW21>AZ21,3,IF(AW21=AZ21,1,0)))","v":3},":",{"$f":"IF(ISBLANK(AZ21),\"0\",IF(AZ21>AW21,3,IF(AZ21=AW21,1,0)))","v":0}]
[null,2,null,{"$f":"D21+$U$5*$X$5+$AL$5","v":"14:17:00"},null,null,null,null,{"$f":"$Q$13","v":"Borussia Salchendorf"},null,null,null,null,null,null,null,null,null,null,null,null,null,null,null,null,null,null,"-",{"$f":"$Q$14","v":"VfL Viktoria Flachsmeer"},null,null,null,null,null,null,null,null,null,null,null,null,null,null,null,null,null,null,null,0,null,":",1,null,null,null,null,null,{"$f":"IF(ISBLANK(AW22),\"0\",IF(AW22>AZ22,3,IF(AW22=AZ22,1,0)))","v":0},":",{"$f":"IF(ISBLANK(AZ22),\"0\",IF(AZ22>AW22,3,IF(AZ22=AW22,1,0)))","v":3}]
[null,3,null,{"$f":"D22+$U$5*$X$5+$AL$5","v":"14:34:00"},null,null,null,null,{"$f":"$Q$15","v":"VfL \"Fortuna\" Veenhusen 3"},null,null,null,null,null,null,null,null,null,null,null,null,null,null,null,null,null,null,"-",{"$f":"$Q$16","v":"JSG Kloster Oesede/Harderberg"},null,null,null,null,null,null,null,null,null,null,null,null,null,null,null,null,null,null,null,0,null,":",4,null,null,null,null,null,0,":",3]
[null,4,null,"14:51:00",null,null,null,null,{"$f":"$Q$11","v":"BW Papenburg"},null,null,null,null,null,null,null,null,null,null,null,null,null,null,null,null,null,null,"-",{"$f":"$Q$13","v":"Borussia Salchendorf"},null,null,null,null,null,null,null,null,null,null,null,null,null,null,null,null,null,null,null,2,null,":",0,null,null,null,null,null,3,":",0]
[null,5,null,"15:08:00",null,null,null,null,{"$f":"$Q$12","v":"TuS Eversten E5"},null,null,null,null,null,null,null,null,null,null,null,null,null,null,null,null,null,null,"-",{"$f":"$Q$15","v":"VfL \"Fortuna\" Veenhusen 3"},null,null,null,null,null,null,null,null,null,null,null,null,null,null,null,null,null,null,null,4,null,":",0,null,null,null,null,null,3,":",0]
[null,6,null,"15:25:00",null,null,null,null,{"$f":"$Q$14","v":"VfL Viktoria Flachsmeer"},null,null,null,null,null,null,null,null,null,null,null,null,null,null,null,null,null,null,"-",{"$f":"$Q$16","v":"JSG Kloster Oesede/Harderberg"},null,null,null,null,null,null,null,null,null,null,null,null,null,null,null,null,null,null,null,2,null,":",0,null,null,null,null,null,3,":",0]
[null,7,null,"15:42:00",null,null,null,null,{"$f":"$Q$15","v":"VfL \"Fortuna\" Veenhusen 3"},null,null,null,null,null,null,null,null,null,null,null,null,null,null,null,null,null,null,"-",{"$f":"$Q$11","v":"BW Papenburg"},null,null,null,null,null,null,null,null,null,null,null,null,null,null,null,null,null,null,null,0,null,":",7,null,null,null,null,null,0,":",3,null,null,null,null,{"$f":"$Q$11","v":"BW Papenburg"},{"$f":"COUNT($AW$21,$AW$24,$AZ$27,$AW$30,$AZ$33)","v":5},{"$f":"SUM($BF$21+$BF$24+$BH$27+$BF$30+$BH$33)","v":15},{"$f":"SUM($AW$21+$AW$24+$AZ$27+$AW$30+$AZ$33)","v":24},":",{"$f":"SUM($AZ$21+$AZ$24+$AW$27+$AZ$30+$AW$33)","v":0},{"$f":"SUM(BP27-BR27)","v":24}]
[null,8,null,"15:59:00",null,null,null,null,{"$f":"$Q$12","v":"TuS Eversten E5"},null,null,null,null,null,null,null,null,null,null,null,null,null,null,null,null,null,null,"-",{"$f":"$Q$14","v":"VfL Viktoria Flachsmeer"},null,null,null,null,null,null,null,null,null,null,null,null,null,null,null,null,null,null,null,0,null,":",2,null,null,null,null,null,0,":",3,null,null,null,null,{"$f":"$Q$14","v":"VfL Viktoria Flachsmeer"},{"$f":"COUNT($AZ$22,$AW$26,$AZ$28,$AZ$30,$AW$35)","v":5},{"$f":"SUM($BH$22+$BF$26+$BH$28+$BH$30+$BF$35)","v":12},{"$f":"SUM($AZ$22+$AW$26+$AZ$28+$AZ$30+$AW$35)","v":9},":",{"$f":"SUM($AW$22+$AZ$26+$AW$28+$AW$30+$AZ$35)","v":3},6]
[null,9,null,"16:16:00",null,null,null,null,{"$f":"$Q$16","v":"JSG Kloster Oesede/Harderberg"},null,null,null,null,null,null,null,null,null,null,null,null,null,null,null,null,null,null,"-",{"$f":"$Q$13","v":"Borussia Salchendorf"},null,null,null,null,null,null,null,null,null,null,null,null,null,null,null,null,null,null,null,1,null,":",0,null,null,null,null,null,3,":",0,null,null,null,null,{"$f":"$Q$16","v":"JSG Kloster Oesede/Harderberg"},{"$f":"COUNT($AZ$23,$AZ$26,$AW$29,$AW$31,$AW$33)","v":5},{"$f":"SUM($BH$23+$BH$26+$BF$29+$BF$31+$BF$33)","v":9},{"$f":"SUM($AZ$23+$AZ$26+$AW$29+$AW$31+$AW$33)","v":7},":",{"$f":"SUM($AW$23+$AW$26+$AZ$29+$AZ$31+$AZ$33)","v":9},-2]
[null,10,null,"16:33:00",null,null,null,null,{"$f":"$Q$11","v":"BW Papenburg"},null,null,null,null,null,null,null,null,null,null,null,null,null,null,null,null,null,null,"-",{"$f":"$Q$14","v":"VfL Viktoria Flachsmeer"},null,null,null,null,null,null,null,null,null,null,null,null,null,null,null,null,null,null,null,3,null,":",0,null,null,null,null,null,3,":",0,null,null,null,null,{"$f":"$Q$12","v":"TuS Eversten E5"},{"$f":"COUNT($AZ$21,$AW$25,$AW$28,$AZ$31,$AW$34)","v":5},{"$f":"SUM($BH$21+$BF$25+$BF$28+$BH$31+$BF$34)","v":6},{"$f":"SUM($AZ$21+$AW$25+$AW$28+$AZ$31+$AW$34)","v":6},":",{"$f":"SUM($AW$21+$AZ$25+$AZ$28+$AW$31+$AZ$34)","v":10},-4]
[null,11,null,"16:50:00",null,null,null,null,{"$f":"$Q$16","v":"JSG Kloster Oesede/Harderberg"},null,null,null,null,null,null,null,null,null,null,null,null,null,null,null,null,null,null,"-",{"$f":"$Q$12","v":"TuS Eversten E5"},null,null,null,null,null,null,null,null,null,null,null,null,null,null,null,null,null,null,null,2,null,":",1,null,null,null,null,null,3,":",0,null,null,null,null,{"$f":"$Q$13","v":"Borussia Salchendorf"},{"$f":"COUNT($AW$22,$AZ$24,$AZ$29,$AW$32,$AZ$34)","v":5},{"$f":"SUM($BF$22+$BH$24+$BH$29+$BF$32+$BH$34)","v":3},{"$f":"SUM($AW$22+$AZ$24+$AZ$29+$AW$32+$AZ$34)","v":8},":",{"$f":"SUM($AZ$22+$AW$24+$AW$29+$AZ$32+$AW$34)","v":5},3]
[null,12,null,"17:07:00",null,null,null,null,{"$f":"$Q$13","v":"Borussia Salchendorf"},null,null,null,null,null,null,null,null,null,null,null,null,null,null,null,null,null,null,"-",{"$f":"$Q$15","v":"VfL \"Fortuna\" Veenhusen 3"},null,null,null,null,null,null,null,null,null,null,null,null,null,null,null,null,null,null,null,8,null,":",0,null,null,null,null,null,3,":",0,null,null,null,null,{"$f":"$Q$15","v":"VfL \"Fortuna\" Veenhusen 3"},{"$f":"COUNT($AW$23,$AZ$25,$AW$27,$AZ$32,$AZ$35)","v":5},{"$f":"SUM($BF$23+$BH$25+$BF$27+$BH$32+$BH$35)","v":0},{"$f":"SUM($AW$23+$AZ$25+$AW$27+$AZ$32+$AZ$35)","v":0},":",{"$f":"SUM($AZ$23+$AW$25+$AZ$27+$AW$32+$AW$35)","v":27},-27]
[null,13,null,"17:24:00",null,null,null,null,{"$f":"$Q$16","v":"JSG Kloster Oesede/Harderberg"},null,null,null,null,null,null,null,null,null,null,null,null,null,null,null,null,null,null,"-",{"$f":"$Q$11","v":"BW Papenburg"},null,null,null,null,null,null,null,null,null,null,null,null,null,null,null,null,null,null,null,0,null,":",6,null,null,null,null,null,0,":",3]
[null,14,null,"17:41:00",null,null,null,null,{"$f":"$Q$12","v":"TuS Eversten E5"},null,null,null,null,null,null,null,null,null,null,null,null,null,null,null,null,null,null,"-",{"$f":"$Q$13","v":"Borussia Salchendorf"},null,null,null,null,null,null,null,null,null,null,null,null,null,null,null,null,null,null,null,1,null,":",0,null,null,null,null,null,3,":",0]
[null,15,null,"17:58:00",null,null,null,null,{"$f":"$Q$14","v":"VfL Viktoria Flachsmeer"},null,null,null,null,null,null,null,null,null,null,null,null,null,null,null,null,null,null,"-",{"$f":"$Q$15","v":"VfL \"Fortuna\" Veenhusen 3"},null,null,null,null,null,null,null,null,null,null,null,null,null,null,null,null,null,null,null,4,null,":",0,null,null,null,null,null,3,":",0]
[]
[null,null,"III. Abschlußtabelle"]
[]
[null,null,null,null,null,null,null,null,"Abschlußtabelle",null,null,null,null,null,null,null,null,null,null,null,null,null,null,null,null,null,null,null,null,null,null,null,null,null,"Sp.",null,null,"Pkt.",null,null,"Tore",null,null,null,null,"Diff."]
[null,null,null,null,null,null,null,null,"1.",null,{"$f":"$BM$27","v":"BW Papenburg"},null,null,null,null,null,null,null,null,null,null,null,null,null,null,null,null,null,null,null,null,null,null,null,{"$f":"$BN$27","v":5},null,null,{"$f":"$BO$27","v":15},null,null,{"$f":"$BP$27","v":24},null,":",{"$f":"$BR$27","v":0},null,{"$f":"$BS$27","v":24}]
[null,null,null,null,null,null,null,null,"2.",null,{"$f":"$BM$28","v":"VfL Viktoria Flachsmeer"},null,null,null,null,null,null,null,null,null,null,null,null,null,null,null,null,null,null,null,null,null,null,null,{"$f":"$BN$28","v":5},null,null,{"$f":"$BO$28","v":12},null,null,{"$f":"$BP$28","v":9},null,":",{"$f":"$BR$28","v":3},null,{"$f":"$BS$28","v":6}]
[null,null,null,null,null,null,null,null,"3.",null,{"$f":"$BM$29","v":"JSG Kloster Oesede/Harderberg"},null,null,null,null,null,null,null,null,null,null,null,null,null,null,null,null,null,null,null,null,null,null,null,{"$f":"$BN$29","v":5},null,null,{"$f":"$BO$29","v":9},null,null,{"$f":"$BP$29","v":7},null,":",{"$f":"$BR$29","v":9},null,{"$f":"$BS$29","v":-2}]
[null,null,null,null,null,null,null,null,"4.",null,{"$f":"$BM$30","v":"TuS Eversten E5"},null,null,null,null,null,null,null,null,null,null,null,null,null,null,null,null,null,null,null,null,null,null,null,{"$f":"$BN$30","v":5},null,null,{"$f":"$BO$30","v":6},null,null,{"$f":"$BP$30","v":6},null,":",{"$f":"$BR$30","v":10},null,{"$f":"$BS$30","v":-4}]
[null,null,null,null,null,null,null,null,"5.",null,{"$f":"$BM$31","v":"Borussia Salchendorf"},null,null,null,null,null,null,null,null,null,null,null,null,null,null,null,null,null,null,null,null,null,null,null,{"$f":"$BN$31","v":5},null,null,{"$f":"$BO$31","v":3},null,null,{"$f":"$BP$31","v":8},null,":",{"$f":"$BR$31","v":5},null,{"$f":"$BS$31","v":3}]
[null,null,null,null,null,null,null,null,"6.",null,{"$f":"$BM$32","v":"VfL \"Fortuna\" Veenhusen 3"},null,null,null,null,null,null,null,null,null,null,null,null,null,null,null,null,null,null,null,null,null,null,null,{"$f":"$BN$32","v":5},null,null,{"$f":"$BO$32","v":0},null,null,{"$f":"$BP$32","v":0},null,":",{"$f":"$BR$32","v":27},null,{"$f":"$BS$32","v":-27}]

{"sheet":"VR Gruppe B","index":2,"n_rows":45,"n_cols":71,"rows_kept":45,"cut":false,"hidden":false,"merged":[[4,7,4,11],[4,20,4,21],[4,23,4,27],[4,37,4,41],[13,14,13,15],[13,16,13,40],[14,14,14,15],[14,16,14,40],[1,0,1,54],[2,0,2,54],[15,14,15,15],[15,16,15,40],[9,14,9,40],[10,14,10,15],[10,16,10,40],[11,14,11,15],[11,16,11,40],[12,14,12,15],[12,16,12,40],[19,1,19,2],[19,3,19,7],[19,8,19,47],[19,48,19,52],[19,53,19,54],[20,1,20,2],[20,3,20,7],[20,8,20,26],[20,28,20,47],[20,48,20,49],[20,51,20,52],[20,53,20,54],[21,1,21,2],[21,3,21,7],[21,8,21,26],[21,28,21,47],[21,48,21,49],[21,51,21,52],[21,53,21,54],[22,53,22,54],[23,1,23,2],[23,3,23,7],[23,8,23,26],[23,28,23,47],[23,48,23,49],[23,51,23,52],[23,53,23,54],[22,1,22,2],[22,3,22,7],[22,8,22,26],[22,28,22,47],[22,48,22,49],[22,51,22,52],[24,53,24,54],[25,1,25,2],[25,3,25,7],[25,8,25,26],[25,28,25,47],[25,48,25,49],[25,51,25,52],[25,53,25,54],[24,1,24,2],[24,3,24,7],[24,8,24,26],[24,28,24,47],[24,48,24,49],[24,51,24,52],[26,53,26,54],[27,1,27,2],[27,3,27,7],[27,8,27,26],[27,28,27,47],[27,48,27,49],[27,51,27,52],[27,53,27,54],[26,1,26,2],[26,3,26,7],[26,8,26,26],[26,28,26,47],[26,48,26,49],[26,51,26,52],[28,53,28,54],[29,1,29,2],[29,3,29,7],[29,8,29,26],[29,28,29,47],[29,48,29,49],[29,51,29,52],[29,53,29,54],[28,1,28,2],[28,3,28,7],[28,8,28,26],[28,28,28,47],[28,48,28,49],[28,51,28,52],[30,53,30,54],[31,1,31,2],[31,3,31,7],[31,8,31,26],[31,28,31,47],[31,48,31,49],[31,51,31,52],[31,53,31,54],[30,1,30,2],[30,3,30,7],[30,8,30,26],[30,28,30,47],[30,48,30,49],[30,51,30,52],[32,53,32,54],[33,1,33,2],[33,3,33,7],[33,8,33,26],[33,28,33,47],[33,48,33,49],[33,51,33,52],[33,53,33,54],[32,1,32,2],[32,3,32,7],[32,8,32,26],[32,28,32,47],[32,48,32,49],[32,51,32,52],[34,53,34,54],[38,8,38,33],[38,34,38,36],[38,37,38,39],[38,40,38,44],[38,45,38,47],[34,1,34,2],[34,3,34,7],[34,8,34,26],[34,28,34,47],[34,48,34,49],[34,51,34,52],[39,45,39,47],[40,8,40,9],[40,10,40,33],[40,34,40,36],[40,37,40,39],[40,40,40,41],[40,43,40,44],[40,45,40,47],[39,8,39,9],[39,10,39,33],[39,34,39,36],[39,37,39,39],[39,40,39,41],[39,43,39,44],[41,45,41,47],[42,8,42,9],[42,10,42,33],[42,34,42,36],[42,37,42,39],[42,40,42,41],[42,43,42,44],[42,45,42,47],[41,8,41,9],[41,10,41,33],[41,34,41,36],[41,37,41,39],[41,40,41,41],[41,43,41,44],[43,45,43,47],[44,8,44,9],[44,10,44,33],[44,34,44,36],[44,37,44,39],[44,40,44,41],[44,43,44,44],[44,45,44,47],[43,8,43,9],[43,10,43,33],[43,34,43,36],[43,37,43,39],[43,40,43,41],[43,43,43,44]]}
[]
["Vorrunde"]
["Gruppe B"]
[]
[null,null,null,null,null,null,"Beginn:","14:00:00",null,null,null,null,"Uhr",null,null,null,null,null,null,"Spielzeit:",1,null,"x","00:15:00",null,null,null,null,"min",null,null,null,null,null,null,null,"Pause:","00:02:00",null,null,null,null,"min"]
[]
[]
[null,"I. Teilnehmende Mannschaften"]
[]
[null,null,null,null,null,null,null,null,null,null,null,null,null,null,"Gruppeneinteilung"]
[null,null,null,null,null,null,null,null,null,null,null,null,null,null,"1.",null,{"$f":"'VR Gruppeneinteilung'!F3","v":"Frisia Loga"}]
[null,null,null,null,null,null,null,null,null,null,null,null,null,null,"2.",null,{"$f":"'VR Gruppeneinteilung'!F4","v":"\"Fortuna\" Veenhusen E-Mädchen"}]
[null,null,null,null,null,null,null,null,null,null,null,null,null,null,"3.",null,{"$f":"'VR Gruppeneinteilung'!F5","v":"TuS  Hasbergen"}]
[null,null,null,null,null,null,null,null,null,null,null,null,null,null,"4.",null,{"$f":"'VR Gruppeneinteilung'!F6","v":"FSV Westerstede"}]
[null,null,null,null,null,null,null,null,null,null,null,null,null,null,"5.",null,{"$f":"'VR Gruppeneinteilung'!F7","v":"JSG Riede/Emtinghausen 1"}]
[null,null,null,null,null,null,null,null,null,null,null,null,null,null,"6.",null,{"$f":"'VR Gruppeneinteilung'!F8","v":"SV Warsingsfehn 3"}]
[]
[null,"II. Spielplan"]
[]
[null,"Nr.",null,"Beginn",null,null,null,null,"Spielpaarung",null,null,null,null,null,null,null,null,null,null,null,null,null,null,null,null,null,null,null,null,null,null,null,null,null,null,null,null,null,null,null,null,null,null,null,null,null,null,null,"Ergebnis",null,null,null,null,null,null,null,null,"Punkte"]
[null,1,null,{"$f":"$H$5","v":"14:00:00"},null,null,null,null,{"$f":"$Q$11","v":"Frisia Loga"},null,null,null,null,null,null,null,null,null,null,null,null,null,null,null,null,null,null,"-",{"$f":"$Q$12","v":"\"Fortuna\" Veenhusen E-Mädchen"},null,null,null,null,null,null,null,null,null,null,null,null,null,null,null,null,null,null,null,11,null,":",0,null,null,null,null,null,{"$f":"IF(ISBLANK(AW21),\"0\",IF(AW21>AZ21,3,IF(AW21=AZ21,1,0)))","v":3},":",{"$f":"IF(ISBLANK(AZ21),\"0\",IF(AZ21>AW21,3,IF(AZ21=AW21,1,0)))","v":0}]
[null,2,null,{"$f":"D21+$U$5*$X$5+$AL$5","v":"14:17:00"},null,null,null,null,{"$f":"$Q$13","v":"TuS  Hasbergen"},null,null,null,null,null,null,null,null,null,null,null,null,null,null,null,null,null,null,"-",{"$f":"$Q$14","v":"FSV Westerstede"},null,null,null,null,null,null,null,null,null,null,null,null,null,null,null,null,null,null,null,0,null,":",2,null,null,null,null,null,{"$f":"IF(ISBLANK(AW22),\"0\",IF(AW22>AZ22,3,IF(AW22=AZ22,1,0)))","v":0},":",{"$f":"IF(ISBLANK(AZ22),\"0\",IF(AZ22>AW22,3,IF(AZ22=AW22,1,0)))","v":3}]
[null,3,null,{"$f":"D22+$U$5*$X$5+$AL$5","v":"14:34:00"},null,null,null,null,{"$f":"$Q$15","v":"JSG Riede/Emtinghausen 1"},null,null,null,null,null,null,null,null,null,null,null,null,null,null,null,null,null,null,"-",{"$f":"$Q$16","v":"SV Warsingsfehn 3"},null,null,null,null,null,null,null,null,null,null,null,null,null,null,null,null,null,null,null,5,null,":",0,null,null,null,null,null,3,":",0]
[null,4,null,"14:51:00",null,null,null,null,{"$f":"$Q$11","v":"Frisia Loga"},null,null,null,null,null,null,null,null,null,null,null,null,null,null,null,null,null,null,"-",{"$f":"$Q$13","v":"TuS  Hasbergen"},null,null,null,null,null,null,null,null,null,null,null,null,null,null,null,null,null,null,null,1,null,":",0,null,null,null,null,null,3,":",0]
[null,5,null,"15:08:00",null,null,null,null,{"$f":"$Q$12","v":"\"Fortuna\" Veenhusen E-Mädchen"},null,null,null,null,null,null,null,null,null,null,null,null,null,null,null,null,null,null,"-",{"$f":"$Q$15","v":"JSG Riede/Emtinghausen 1"},null,null,null,null,null,null,null,null,null,null,null,null,null,null,null,null,null,null,null,0,null,":",1,null,null,null,null,null,0,":",3]
[null,6,null,"15:25:00",null,null,null,null,{"$f":"$Q$14","v":"FSV Westerstede"},null,null,null,null,null,null,null,null,null,null,null,null,null,null,null,null,null,null,"-",{"$f":"$Q$16","v":"SV Warsingsfehn 3"},null,null,null,null,null,null,null,null,null,null,null,null,null,null,null,null,null,null,null,2,null,":",0,null,null,null,null,null,3,":",0]
[null,7,null,"15:42:00",null,null,null,null,{"$f":"$Q$15","v":"JSG Riede/Emtinghausen 1"},null,null,null,null,null,null,null,null,null,null,null,null,null,null,null,null,null,null,"-",{"$f":"$Q$11","v":"Frisia Loga"},null,null,null,null,null,null,null,null,null,null,null,null,null,null,null,null,null,null,null,2,null,":",0,null,null,null,null,null,3,":",0,null,null,null,null,{"$f":"$Q$15","v":"JSG Riede/Emtinghausen 1"},{"$f":"COUNT($AW$23,$AZ$25,$AW$27,$AZ$32,$AZ$35)","v":5},{"$f":"SUM($BF$23+$BH$25+$BF$27+$BH$32+$BH$35)","v":13},{"$f":"SUM($AW$23+$AZ$25+$AW$27+$AZ$32+$AZ$35)","v":9},":",{"$f":"SUM($AZ$23+$AW$25+$AZ$27+$AW$32+$AW$35)","v":0},{"$f":"SUM(BP27-BR27)","v":9}]
[null,8,null,"15:59:00",null,null,null,null,{"$f":"$Q$12","v":"\"Fortuna\" Veenhusen E-Mädchen"},null,null,null,null,null,null,null,null,null,null,null,null,null,null,null,null,null,null,"-",{"$f":"$Q$14","v":"FSV Westerstede"},null,null,null,null,null,null,null,null,null,null,null,null,null,null,null,null,null,null,null,0,null,":",5,null,null,null,null,null,0,":",3,null,null,null,null,{"$f":"$Q$11","v":"Frisia Loga"},{"$f":"COUNT($AW$21,$AW$24,$AZ$27,$AW$30,$AZ$33)","v":5},{"$f":"SUM($BF$21+$BF$24+$BH$27+$BF$30+$BH$33)","v":12},{"$f":"SUM($AW$21+$AW$24+$AZ$27+$AW$30+$AZ$33)","v":15},":",{"$f":"SUM($AZ$21+$AZ$24+$AW$27+$AZ$30+$AW$33)","v":2},13]
[null,9,null,"16:16:00",null,null,null,null,{"$f":"$Q$16","v":"SV Warsingsfehn 3"},null,null,null,null,null,null,null,null,null,null,null,null,null,null,null,null,null,null,"-",{"$f":"$Q$13","v":"TuS  Hasbergen"},null,null,null,null,null,null,null,null,null,null,null,null,null,null,null,null,null,null,null,0,null,":",5,null,null,null,null,null,0,":",3,null,null,null,null,{"$f":"$Q$14","v":"FSV Westerstede"},{"$f":"COUNT($AZ$22,$AW$26,$AZ$28,$AZ$30,$AW$35)","v":5},{"$f":"SUM($BH$22+$BF$26+$BH$28+$BH$30+$BF$35)","v":10},{"$f":"SUM($AZ$22+$AW$26+$AZ$28+$AZ$30+$AW$35)","v":9},":",{"$f":"SUM($AW$22+$AZ$26+$AW$28+$AW$30+$AZ$35)","v":2},7]
[null,10,null,"16:33:00",null,null,null,null,{"$f":"$Q$11","v":"Frisia Loga"},null,null,null,null,null,null,null,null,null,null,null,null,null,null,null,null,null,null,"-",{"$f":"$Q$14","v":"FSV Westerstede"},null,null,null,null,null,null,null,null,null,null,null,null,null,null,null,null,null,null,null,2,null,":",0,null,null,null,null,null,3,":",0,null,null,null,null,{"$f":"$Q$13","v":"TuS  Hasbergen"},{"$f":"COUNT($AW$22,$AZ$24,$AZ$29,$AW$32,$AZ$34)","v":5},{"$f":"SUM($BF$22+$BH$24+$BH$29+$BF$32+$BH$34)","v":6},{"$f":"SUM($AW$22+$AZ$24+$AZ$29+$AW$32+$AZ$34)","v":11},":",{"$f":"SUM($AZ$22+$AW$24+$AW$29+$AZ$32+$AW$34)","v":4},7]
[null,11,null,"16:50:00",null,null,null,null,{"$f":"$Q$16","v":"SV Warsingsfehn 3"},null,null,null,null,null,null,null,null,null,null,null,null,null,null,null,null,null,null,"-",{"$f":"$Q$12","v":"\"Fortuna\" Veenhusen E-Mädchen"},null,null,null,null,null,null,null,null,null,null,null,null,null,null,null,null,null,null,null,1,null,":",0,null,null,null,null,null,3,":",0,null,null,null,null,{"$f":"$Q$16","v":"SV Warsingsfehn 3"},{"$f":"COUNT($AZ$23,$AZ$26,$AW$29,$AW$31,$AW$33)","v":5},{"$f":"SUM($BH$23+$BH$26+$BF$29+$BF$31+$BF$33)","v":3},{"$f":"SUM($AZ$23+$AZ$26+$AW$29+$AW$31+$AW$33)","v":1},":",{"$f":"SUM($AW$23+$AW$26+$AZ$29+$AZ$31+$AZ$33)","v":13},-12]
[null,12,null,"17:07:00",null,null,null,null,{"$f":"$Q$13","v":"TuS  Hasbergen"},null,null,null,null,null,null,null,null,null,null,null,null,null,null,null,null,null,null,"-",{"$f":"$Q$15","v":"JSG Riede/Emtinghausen 1"},null,null,null,null,null,null,null,null,null,null,null,null,null,null,null,null,null,null,null,0,null,":",1,null,null,null,null,null,0,":",3,null,null,null,null,{"$f":"$Q$12","v":"\"Fortuna\" Veenhusen E-Mädchen"},{"$f":"COUNT($AZ$21,$AW$25,$AW$28,$AZ$31,$AW$34)","v":5},{"$f":"SUM($BH$21+$BF$25+$BF$28+$BH$31+$BF$34)","v":0},{"$f":"SUM($AZ$21+$AW$25+$AW$28+$AZ$31+$AW$34)","v":0},":",{"$f":"SUM($AW$21+$AZ$25+$AZ$28+$AW$31+$AZ$34)","v":24},-24]
[null,13,null,"17:24:00",null,null,null,null,{"$f":"$Q$16","v":"SV Warsingsfehn 3"},null,null,null,null,null,null,null,null,null,null,null,null,null,null,null,null,null,null,"-",{"$f":"$Q$11","v":"Frisia Loga"},null,null,null,null,null,null,null,null,null,null,null,null,null,null,null,null,null,null,null,0,null,":",1,null,null,null,null,null,0,":",3]
[null,14,null,"17:41:00",null,null,null,null,{"$f":"$Q$12","v":"\"Fortuna\" Veenhusen E-Mädchen"},null,null,null,null,null,null,null,null,null,null,null,null,null,null,null,null,null,null,"-",{"$f":"$Q$13","v":"TuS  Hasbergen"},null,null,null,null,null,null,null,null,null,null,null,null,null,null,null,null,null,null,null,0,null,":",6,null,null,null,null,null,0,":",3]
[null,15,null,"17:58:00",null,null,null,null,{"$f":"$Q$14","v":"FSV Westerstede"},null,null,null,null,null,null,null,null,null,null,null,null,null,null,null,null,null,null,"-",{"$f":"$Q$15","v":"JSG Riede/Emtinghausen 1"},null,null,null,null,null,null,null,null,null,null,null,null,null,null,null,null,null,null,null,0,null,":",0,null,null,null,null,null,1,":",1]
[]
[null,null,"III. Abschlußtabelle"]
[]
[null,null,null,null,null,null,null,null,"Abschlußtabelle",null,null,null,null,null,null,null,null,null,null,null,null,null,null,null,null,null,null,null,null,null,null,null,null,null,"Sp.",null,null,"Pkt.",null,null,"Tore",null,null,null,null,"Diff."]
[null,null,null,null,null,null,null,null,"1.",null,{"$f":"$BM$27","v":"JSG Riede/Emtinghausen 1"},null,null,null,null,null,null,null,null,null,null,null,null,null,null,null,null,null,null,null,null,null,null,null,{"$f":"$BN$27","v":5},null,null,{"$f":"$BO$27","v":13},null,null,{"$f":"$BP$27","v":9},null,":",{"$f":"$BR$27","v":0},null,{"$f":"$BS$27","v":9}]
[null,null,null,null,null,null,null,null,"2.",null,{"$f":"$BM$28","v":"Frisia Loga"},null,null,null,null,null,null,null,null,null,null,null,null,null,null,null,null,null,null,null,null,null,null,null,{"$f":"$BN$28","v":5},null,null,{"$f":"$BO$28","v":12},null,null,{"$f":"$BP$28","v":15},null,":",{"$f":"$BR$28","v":2},null,{"$f":"$BS$28","v":13}]
[null,null,null,null,null,null,null,null,"3.",null,{"$f":"$BM$29","v":"FSV Westerstede"},null,null,null,null,null,null,null,null,null,null,null,null,null,null,null,null,null,null,null,null,null,null,null,{"$f":"$BN$29","v":5},null,null,{"$f":"$BO$29","v":10},null,null,{"$f":"$BP$29","v":9},null,":",{"$f":"$BR$29","v":2},null,{"$f":"$BS$29","v":7}]
[null,null,null,null,null,null,null,null,"4.",null,{"$f":"$BM$30","v":"TuS  Hasbergen"},null,null,null,null,null,null,null,null,null,null,null,null,null,null,null,null,null,null,null,null,null,null,null,{"$f":"$BN$30","v":5},null,null,{"$f":"$BO$30","v":6},null,null,{"$f":"$BP$30","v":11},null,":",{"$f":"$BR$30","v":4},null,{"$f":"$BS$30","v":7}]
[null,null,null,null,null,null,null,null,"5.",null,{"$f":"$BM$31","v":"SV Warsingsfehn 3"},null,null,null,null,null,null,null,null,null,null,null,null,null,null,null,null,null,null,null,null,null,null,null,{"$f":"$BN$31","v":5},null,null,{"$f":"$BO$31","v":3},null,null,{"$f":"$BP$31","v":1},null,":",{"$f":"$BR$31","v":13},null,{"$f":"$BS$31","v":-12}]
[null,null,null,null,null,null,null,null,"6.",null,{"$f":"$BM$32","v":"\"Fortuna\" Veenhusen E-Mädchen"},null,null,null,null,null,null,null,null,null,null,null,null,null,null,null,null,null,null,null,null,null,null,null,{"$f":"$BN$32","v":5},null,null,{"$f":"$BO$32","v":0},null,null,{"$f":"$BP$32","v":0},null,":",{"$f":"$BR$32","v":24},null,{"$f":"$BS$32","v":-24}]

{"sheet":"VR Gruppe C","index":3,"n_rows":45,"n_cols":71,"rows_kept":45,"cut":false,"hidden":false,"merged":[[1,0,1,54],[15,14,15,15],[15,16,15,40],[9,14,9,40],[10,14,10,15],[10,16,10,40],[11,14,11,15],[11,16,11,40],[12,14,12,15],[12,16,12,40],[4,7,4,11],[4,20,4,21],[4,23,4,27],[4,37,4,41],[13,14,13,15],[13,16,13,40],[14,14,14,15],[14,16,14,40],[2,0,2,54],[19,1,19,2],[19,3,19,7],[19,8,19,47],[19,48,19,52],[19,53,19,54],[20,1,20,2],[20,3,20,7],[20,8,20,26],[20,28,20,47],[20,48,20,49],[20,51,20,52],[20,53,20,54],[21,1,21,2],[21,3,21,7],[21,8,21,26],[21,28,21,47],[21,48,21,49],[21,51,21,52],[21,53,21,54],[22,53,22,54],[23,1,23,2],[23,3,23,7],[23,8,23,26],[23,28,23,47],[23,48,23,49],[23,51,23,52],[23,53,23,54],[22,1,22,2],[22,3,22,7],[22,8,22,26],[22,28,22,47],[22,48,22,49],[22,51,22,52],[24,53,24,54],[25,1,25,2],[25,3,25,7],[25,8,25,26],[25,28,25,47],[25,48,25,49],[25,51,25,52],[25,53,25,54],[24,1,24,2],[24,3,24,7],[24,8,24,26],[24,28,24,47],[24,48,24,49],[24,51,24,52],[26,53,26,54],[27,1,27,2],[27,3,27,7],[27,8,27,26],[27,28,27,47],[27,48,27,49],[27,51,27,52],[27,53,27,54],[26,1,26,2],[26,3,26,7],[26,8,26,26],[26,28,26,47],[26,48,26,49],[26,51,26,52],[28,53,28,54],[29,1,29,2],[29,3,29,7],[29,8,29,26],[29,28,29,47],[29,48,29,49],[29,51,29,52],[29,53,29,54],[28,1,28,2],[28,3,28,7],[28,8,28,26],[28,28,28,47],[28,48,28,49],[28,51,28,52],[30,53,30,54],[31,1,31,2],[31,3,31,7],[31,8,31,26],[31,28,31,47],[31,48,31,49],[31,51,31,52],[31,53,31,54],[30,1,30,2],[30,3,30,7],[30,8,30,26],[30,28,30,47],[30,48,30,49],[30,51,30,52],[32,53,32,54],[33,1,33,2],[33,3,33,7],[33,8,33,26],[33,28,33,47],[33,48,33,49],[33,51,33,52],[33,53,33,54],[32,1,32,2],[32,3,32,7],[32,8,32,26],[32,28,32,47],[32,48,32,49],[32,51,32,52],[34,53,34,54],[38,8,38,33],[38,34,38,36],[38,37,38,39],[38,40,38,44],[38,45,38,47],[34,1,34,2],[34,3,34,7],[34,8,34,26],[34,28,34,47],[34,48,34,49],[34,51,34,52],[39,45,39,47],[40,8,40,9],[40,10,40,33],[40,34,40,36],[40,37,40,39],[40,40,40,41],[40,43,40,44],[40,45,40,47],[39,8,39,9],[39,10,39,33],[39,34,39,36],[39,37,39,39],[39,40,39,41],[39,43,39,44],[41,45,41,47],[42,8,42,9],[42,10,42,33],[42,34,42,36],[42,37,42,39],[42,40,42,41],[42,43,42,44],[42,45,42,47],[41,8,41,9],[41,10,41,33],[41,34,41,36],[41,37,41,39],[41,40,41,41],[41,43,41,44],[43,45,43,47],[44,8,44,9],[44,10,44,33],[44,34,44,36],[44,37,44,39],[44,40,44,41],[44,43,44,44],[44,45,44,47],[43,8,43,9],[43,10,43,33],[43,34,43,36],[43,37,43,39],[43,40,43,41],[43,43,43,44]]}
[]
["Vorrunde"]
["Gruppe C"]
[]
[null,null,null,null,null,null,"Beginn:","14:00:00",null,null,null,null,"Uhr",null,null,null,null,null,null,"Spielzeit:",1,null,"x","00:15:00",null,null,null,null,"min",null,null,null,null,null,null,null,"Pause:","00:02:00",null,null,null,null,"min"]
[]
[]
[null,"I. Teilnehmende Mannschaften"]
[]
[null,null,null,null,null,null,null,null,null,null,null,null,null,null,"Gruppeneinteilung"]
[null,null,null,null,null,null,null,null,null,null,null,null,null,null,"1.",null,{"$f":"'VR Gruppeneinteilung'!B12","v":"VfL \"Fortuna\" Veenhusen 1"}]
[null,null,null,null,null,null,null,null,null,null,null,null,null,null,"2.",null,{"$f":"'VR Gruppeneinteilung'!B13","v":"TV Jahn Delmenhorst"}]
[null,null,null,null,null,null,null,null,null,null,null,null,null,null,"3.",null,{"$f":"'VR Gruppeneinteilung'!B14","v":"JSG Riede/Emtinghausen 2"}]
[null,null,null,null,null,null,null,null,null,null,null,null,null,null,"4.",null,{"$f":"'VR Gruppeneinteilung'!B15","v":"TuS Holthusen"}]
[null,null,null,null,null,null,null,null,null,null,null,null,null,null,"5.",null,{"$f":"'VR Gruppeneinteilung'!B16","v":"TuS Strudden 1"}]
[null,null,null,null,null,null,null,null,null,null,null,null,null,null,"6.",null,{"$f":"'VR Gruppeneinteilung'!B17","v":"BW Galgenmoor"}]
[]
[null,"II. Spielplan"]
[]
[null,"Nr.",null,"Beginn",null,null,null,null,"Spielpaarung",null,null,null,null,null,null,null,null,null,null,null,null,null,null,null,null,null,null,null,null,null,null,null,null,null,null,null,null,null,null,null,null,null,null,null,null,null,null,null,"Ergebnis",null,null,null,null,null,null,null,null,"Punkte"]
[null,1,null,{"$f":"$H$5","v":"14:00:00"},null,null,null,null,{"$f":"$Q$11","v":"VfL \"Fortuna\" Veenhusen 1"},null,null,null,null,null,null,null,null,null,null,null,null,null,null,null,null,null,null,"-",{"$f":"$Q$12","v":"TV Jahn Delmenhorst"},null,null,null,null,null,null,null,null,null,null,null,null,null,null,null,null,null,null,null,0,null,":",1,null,null,null,null,null,{"$f":"IF(ISBLANK(AW21),\"0\",IF(AW21>AZ21,3,IF(AW21=AZ21,1,0)))","v":0},":",{"$f":"IF(ISBLANK(AZ21),\"0\",IF(AZ21>AW21,3,IF(AZ21=AW21,1,0)))","v":3}]
[null,2,null,{"$f":"D21+$U$5*$X$5+$AL$5","v":"14:17:00"},null,null,null,null,{"$f":"$Q$13","v":"JSG Riede/Emtinghausen 2"},null,null,null,null,null,null,null,null,null,null,null,null,null,null,null,null,null,null,"-",{"$f":"$Q$14","v":"TuS Holthusen"},null,null,null,null,null,null,null,null,null,null,null,null,null,null,null,null,null,null,null,1,null,":",0,null,null,null,null,null,{"$f":"IF(ISBLANK(AW22),\"0\",IF(AW22>AZ22,3,IF(AW22=AZ22,1,0)))","v":3},":",{"$f":"IF(ISBLANK(AZ22),\"0\",IF(AZ22>AW22,3,IF(AZ22=AW22,1,0)))","v":0}]
[null,3,null,{"$f":"D22+$U$5*$X$5+$AL$5","v":"14:34:00"},null,null,null,null,{"$f":"$Q$15","v":"TuS Strudden 1"},null,null,null,null,null,null,null,null,null,null,null,null,null,null,null,null,null,null,"-",{"$f":"$Q$16","v":"BW Galgenmoor"},null,null,null,null,null,null,null,null,null,null,null,null,null,null,null,null,null,null,null,3,null,":",0,null,null,null,null,null,3,":",0]
[null,4,null,"14:51:00",null,null,null,null,{"$f":"$Q$11","v":"VfL \"Fortuna\" Veenhusen 1"},null,null,null,null,null,null,null,null,null,null,null,null,null,null,null,null,null,null,"-",{"$f":"$Q$13","v":"JSG Riede/Emtinghausen 2"},null,null,null,null,null,null,null,null,null,null,null,null,null,null,null,null,null,null,null,2,null,":",0,null,null,null,null,null,3,":",0]
[null,5,null,"15:08:00",null,null,null,null,{"$f":"$Q$12","v":"TV Jahn Delmenhorst"},null,null,null,null,null,null,null,null,null,null,null,null,null,null,null,null,null,null,"-",{"$f":"$Q$15","v":"TuS Strudden 1"},null,null,null,null,null,null,null,null,null,null,null,null,null,null,null,null,null,null,null,1,null,":",0,null,null,null,null,null,3,":",0]
[null,6,null,"15:25:00",null,null,null,null,{"$f":"$Q$14","v":"TuS Holthusen"},null,null,null,null,null,null,null,null,null,null,null,null,null,null,null,null,null,null,"-",{"$f":"$Q$16","v":"BW Galgenmoor"},null,null,null,null,null,null,null,null,null,null,null,null,null,null,null,null,null,null,null,2,null,":",0,null,null,null,null,null,3,":",0]
[null,7,null,"15:42:00",null,null,null,null,{"$f":"$Q$15","v":"TuS Strudden 1"},null,null,null,null,null,null,null,null,null,null,null,null,null,null,null,null,null,null,"-",{"$f":"$Q$11","v":"VfL \"Fortuna\" Veenhusen 1"},null,null,null,null,null,null,null,null,null,null,null,null,null,null,null,null,null,null,null,1,null,":",3,null,null,null,null,null,0,":",3,null,null,null,null,{"$f":"$Q$12","v":"TV Jahn Delmenhorst"},{"$f":"COUNT($AZ$21,$AW$25,$AW$28,$AZ$31,$AW$34)","v":5},{"$f":"SUM($BH$21+$BF$25+$BF$28+$BH$31+$BF$34)","v":15},{"$f":"SUM($AZ$21+$AW$25+$AW$28+$AZ$31+$AW$34)","v":20},":",{"$f":"SUM($AW$21+$AZ$25+$AZ$28+$AW$31+$AZ$34)","v":0},{"$f":"SUM(BP27-BR27)","v":20}]
[null,8,null,"15:59:00",null,null,null,null,{"$f":"$Q$12","v":"TV Jahn Delmenhorst"},null,null,null,null,null,null,null,null,null,null,null,null,null,null,null,null,null,null,"-",{"$f":"$Q$14","v":"TuS Holthusen"},null,null,null,null,null,null,null,null,null,null,null,null,null,null,null,null,null,null,null,5,null,":",0,null,null,null,null,null,3,":",0,null,null,null,null,{"$f":"$Q$11","v":"VfL \"Fortuna\" Veenhusen 1"},{"$f":"COUNT($AW$21,$AW$24,$AZ$27,$AW$30,$AZ$33)","v":5},{"$f":"SUM($BF$21+$BF$24+$BH$27+$BF$30+$BH$33)","v":12},{"$f":"SUM($AW$21+$AW$24+$AZ$27+$AW$30+$AZ$33)","v":14},":",{"$f":"SUM($AZ$21+$AZ$24+$AW$27+$AZ$30+$AW$33)","v":2},12]
[null,9,null,"16:16:00",null,null,null,null,{"$f":"$Q$16","v":"BW Galgenmoor"},null,null,null,null,null,null,null,null,null,null,null,null,null,null,null,null,null,null,"-",{"$f":"$Q$13","v":"JSG Riede/Emtinghausen 2"},null,null,null,null,null,null,null,null,null,null,null,null,null,null,null,null,null,null,null,0,null,":",2,null,null,null,null,null,0,":",3,null,null,null,null,{"$f":"$Q$15","v":"TuS Strudden 1"},{"$f":"COUNT($AW$23,$AZ$25,$AW$27,$AZ$32,$AZ$35)","v":5},{"$f":"SUM($BF$23+$BH$25+$BF$27+$BH$32+$BH$35)","v":9},{"$f":"SUM($AW$23+$AZ$25+$AW$27+$AZ$32+$AZ$35)","v":12},":",{"$f":"SUM($AZ$23+$AW$25+$AZ$27+$AW$32+$AW$35)","v":6},6]
[null,10,null,"16:33:00",null,null,null,null,{"$f":"$Q$11","v":"VfL \"Fortuna\" Veenhusen 1"},null,null,null,null,null,null,null,null,null,null,null,null,null,null,null,null,null,null,"-",{"$f":"$Q$14","v":"TuS Holthusen"},null,null,null,null,null,null,null,null,null,null,null,null,null,null,null,null,null,null,null,4,null,":",0,null,null,null,null,null,3,":",0,null,null,null,null,{"$f":"$Q$13","v":"JSG Riede/Emtinghausen 2"},{"$f":"COUNT($AW$22,$AZ$24,$AZ$29,$AW$32,$AZ$34)","v":5},{"$f":"SUM($BF$22+$BH$24+$BH$29+$BF$32+$BH$34)","v":6},{"$f":"SUM($AW$22+$AZ$24+$AZ$29+$AW$32+$AZ$34)","v":4},":",{"$f":"SUM($AZ$22+$AW$24+$AW$29+$AZ$32+$AW$34)","v":9},-5]
[null,11,null,"16:50:00",null,null,null,null,{"$f":"$Q$16","v":"BW Galgenmoor"},null,null,null,null,null,null,null,null,null,null,null,null,null,null,null,null,null,null,"-",{"$f":"$Q$12","v":"TV Jahn Delmenhorst"},null,null,null,null,null,null,null,null,null,null,null,null,null,null,null,null,null,null,null,0,null,":",10,null,null,null,null,null,0,":",3,null,null,null,null,{"$f":"$Q$14","v":"TuS Holthusen"},{"$f":"COUNT($AZ$22,$AW$26,$AZ$28,$AZ$30,$AW$35)","v":5},{"$f":"SUM($BH$22+$BF$26+$BH$28+$BH$30+$BF$35)","v":3},{"$f":"SUM($AZ$22+$AW$26+$AZ$28+$AZ$30+$AW$35)","v":3},":",{"$f":"SUM($AW$22+$AZ$26+$AW$28+$AW$30+$AZ$35)","v":14},-11]
[null,12,null,"17:07:00",null,null,null,null,{"$f":"$Q$13","v":"JSG Riede/Emtinghausen 2"},null,null,null,null,null,null,null,null,null,null,null,null,null,null,null,null,null,null,"-",{"$f":"$Q$15","v":"TuS Strudden 1"},null,null,null,null,null,null,null,null,null,null,null,null,null,null,null,null,null,null,null,1,null,":",4,null,null,null,null,null,0,":",3,null,null,null,null,{"$f":"$Q$16","v":"BW Galgenmoor"},{"$f":"COUNT($AZ$23,$AZ$26,$AW$29,$AW$31,$AW$33)","v":5},{"$f":"SUM($BH$23+$BH$26+$BF$29+$BF$31+$BF$33)","v":0},{"$f":"SUM($AZ$23+$AZ$26+$AW$29+$AW$31+$AW$33)","v":0},":",{"$f":"SUM($AW$23+$AW$26+$AZ$29+$AZ$31+$AZ$33)","v":22},-22]
[null,13,null,"17:24:00",null,null,null,null,{"$f":"$Q$16","v":"BW Galgenmoor"},null,null,null,null,null,null,null,null,null,null,null,null,null,null,null,null,null,null,"-",{"$f":"$Q$11","v":"VfL \"Fortuna\" Veenhusen 1"},null,null,null,null,null,null,null,null,null,null,null,null,null,null,null,null,null,null,null,0,null,":",5,null,null,null,null,null,0,":",3]
[null,14,null,"17:41:00",null,null,null,null,{"$f":"$Q$12","v":"TV Jahn Delmenhorst"},null,null,null,null,null,null,null,null,null,null,null,null,null,null,null,null,null,null,"-",{"$f":"$Q$13","v":"JSG Riede/Emtinghausen 2"},null,null,null,null,null,null,null,null,null,null,null,null,null,null,null,null,null,null,null,3,null,":",0,null,null,null,null,null,3,":",0]
[null,15,null,"17:58:00",null,null,null,null,{"$f":"$Q$14","v":"TuS Holthusen"},null,null,null,null,null,null,null,null,null,null,null,null,null,null,null,null,null,null,"-",{"$f":"$Q$15","v":"TuS Strudden 1"},null,null,null,null,null,null,null,null,null,null,null,null,null,null,null,null,null,null,null,1,null,":",4,null,null,null,null,null,0,":",3]
[]
[null,null,"III. Abschlußtabelle"]
[]
[null,null,null,null,null,null,null,null,"Abschlußtabelle",null,null,null,null,null,null,null,null,null,null,null,null,null,null,null,null,null,null,null,null,null,null,null,null,null,"Sp.",null,null,"Pkt.",null,null,"Tore",null,null,null,null,"Diff."]
[null,null,null,null,null,null,null,null,"1.",null,{"$f":"$BM$27","v":"TV Jahn Delmenhorst"},null,null,null,null,null,null,null,null,null,null,null,null,null,null,null,null,null,null,null,null,null,null,null,{"$f":"$BN$27","v":5},null,null,{"$f":"$BO$27","v":15},null,null,{"$f":"$BP$27","v":20},null,":",{"$f":"$BR$27","v":0},null,{"$f":"$BS$27","v":20}]
[null,null,null,null,null,null,null,null,"2.",null,{"$f":"$BM$28","v":"VfL \"Fortuna\" Veenhusen 1"},null,null,null,null,null,null,null,null,null,null,null,null,null,null,null,null,null,null,null,null,null,null,null,{"$f":"$BN$28","v":5},null,null,{"$f":"$BO$28","v":12},null,null,{"$f":"$BP$28","v":14},null,":",{"$f":"$BR$28","v":2},null,{"$f":"$BS$28","v":12}]
[null,null,null,null,null,null,null,null,"3.",null,{"$f":"$BM$29","v":"TuS Strudden 1"},null,null,null,null,null,null,null,null,null,null,null,null,null,null,null,null,null,null,null,null,null,null,null,{"$f":"$BN$29","v":5},null,null,{"$f":"$BO$29","v":9},null,null,{"$f":"$BP$29","v":12},null,":",{"$f":"$BR$29","v":6},null,{"$f":"$BS$29","v":6}]
[null,null,null,null,null,null,null,null,"4.",null,{"$f":"$BM$30","v":"JSG Riede/Emtinghausen 2"},null,null,null,null,null,null,null,null,null,null,null,null,null,null,null,null,null,null,null,null,null,null,null,{"$f":"$BN$30","v":5},null,null,{"$f":"$BO$30","v":6},null,null,{"$f":"$BP$30","v":4},null,":",{"$f":"$BR$30","v":9},null,{"$f":"$BS$30","v":-5}]
[null,null,null,null,null,null,null,null,"5.",null,{"$f":"$BM$31","v":"TuS Holthusen"},null,null,null,null,null,null,null,null,null,null,null,null,null,null,null,null,null,null,null,null,null,null,null,{"$f":"$BN$31","v":5},null,null,{"$f":"$BO$31","v":3},null,null,{"$f":"$BP$31","v":3},null,":",{"$f":"$BR$31","v":14},null,{"$f":"$BS$31","v":-11}]
[null,null,null,null,null,null,null,null,"6.",null,{"$f":"$BM$32","v":"BW Galgenmoor"},null,null,null,null,null,null,null,null,null,null,null,null,null,null,null,null,null,null,null,null,null,null,null,{"$f":"$BN$32","v":5},null,null,{"$f":"$BO$32","v":0},null,null,{"$f":"$BP$32","v":0},null,":",{"$f":"$BR$32","v":22},null,{"$f":"$BS$32","v":-22}]

{"sheet":"VR Gruppe D","index":4,"n_rows":45,"n_cols":71,"rows_kept":45,"cut":false,"hidden":false,"merged":[[0,0,1,54],[15,14,15,15],[15,16,15,40],[9,14,9,40],[10,14,10,15],[10,16,10,40],[11,14,11,15],[11,16,11,40],[12,14,12,15],[12,16,12,40],[4,7,4,11],[4,20,4,21],[4,23,4,27],[4,37,4,41],[13,14,13,15],[13,16,13,40],[14,14,14,15],[14,16,14,40],[2,0,2,54],[19,1,19,2],[19,3,19,7],[19,8,19,47],[19,48,19,52],[19,53,19,54],[20,1,20,2],[20,3,20,7],[20,8,20,26],[20,28,20,47],[20,48,20,49],[20,51,20,52],[20,53,20,54],[21,1,21,2],[21,3,21,7],[21,8,21,26],[21,28,21,47],[21,48,21,49],[21,51,21,52],[21,53,21,54],[22,53,22,54],[23,1,23,2],[23,3,23,7],[23,8,23,26],[23,28,23,47],[23,48,23,49],[23,51,23,52],[23,53,23,54],[22,1,22,2],[22,3,22,7],[22,8,22,26],[22,28,22,47],[22,48,22,49],[22,51,22,52],[24,53,24,54],[25,1,25,2],[25,3,25,7],[25,8,25,26],[25,28,25,47],[25,48,25,49],[25,51,25,52],[25,53,25,54],[24,1,24,2],[24,3,24,7],[24,8,24,26],[24,28,24,47],[24,48,24,49],[24,51,24,52],[26,53,26,54],[27,1,27,2],[27,3,27,7],[27,8,27,26],[27,28,27,47],[27,48,27,49],[27,51,27,52],[27,53,27,54],[26,1,26,2],[26,3,26,7],[26,8,26,26],[26,28,26,47],[26,48,26,49],[26,51,26,52],[28,53,28,54],[29,1,29,2],[29,3,29,7],[29,8,29,26],[29,28,29,47],[29,48,29,49],[29,51,29,52],[29,53,29,54],[28,1,28,2],[28,3,28,7],[28,8,28,26],[28,28,28,47],[28,48,28,49],[28,51,28,52],[30,53,30,54],[31,1,31,2],[31,3,31,7],[31,8,31,26],[31,28,31,47],[31,48,31,49],[31,51,31,52],[31,53,31,54],[30,1,30,2],[30,3,30,7],[30,8,30,26],[30,28,30,47],[30,48,30,49],[30,51,30,52],[32,53,32,54],[33,1,33,2],[33,3,33,7],[33,8,33,26],[33,28,33,47],[33,48,33,49],[33,51,33,52],[33,53,33,54],[32,1,32,2],[32,3,32,7],[32,8,32,26],[32,28,32,47],[32,48,32,49],[32,51,32,52],[34,53,34,54],[38,8,38,33],[38,34,38,36],[38,37,38,39],[38,40,38,44],[38,45,38,47],[34,1,34,2],[34,3,34,7],[34,8,34,26],[34,28,34,47],[34,48,34,49],[34,51,34,52],[39,45,39,47],[40,8,40,9],[40,10,40,33],[40,34,40,36],[40,37,40,39],[40,40,40,41],[40,43,40,44],[40,45,40,47],[39,8,39,9],[39,10,39,33],[39,34,39,36],[39,37,39,39],[39,40,39,41],[39,43,39,44],[41,45,41,47],[42,8,42,9],[42,10,42,33],[42,34,42,36],[42,37,42,39],[42,40,42,41],[42,43,42,44],[42,45,42,47],[41,8,41,9],[41,10,41,33],[41,34,41,36],[41,37,41,39],[41,40,41,41],[41,43,41,44],[43,45,43,47],[44,8,44,9],[44,10,44,33],[44,34,44,36],[44,37,44,39],[44,40,44,41],[44,43,44,44],[44,45,44,47],[43,8,43,9],[43,10,43,33],[43,34,43,36],[43,37,43,39],[43,40,43,41],[43,43,43,44]]}
["Vorrunde"]
[]
["Gruppe D"]
[]
[null,null,null,null,null,null,"Beginn:","14:00:00",null,null,null,null,"Uhr",null,null,null,null,null,null,"Spielzeit:",1,null,"x","00:15:00",null,null,null,null,"min",null,null,null,null,null,null,null,"Pause:","00:02:00",null,null,null,null,"min"]
[]
[]
[null,"I. Teilnehmende Mannschaften"]
[]
[null,null,null,null,null,null,null,null,null,null,null,null,null,null,"Gruppeneinteilung"]
[null,null,null,null,null,null,null,null,null,null,null,null,null,null,"1.",null,{"$f":"'VR Gruppeneinteilung'!F12","v":"VfL Germania Leer"}]
[null,null,null,null,null,null,null,null,null,null,null,null,null,null,"2.",null,{"$f":"'VR Gruppeneinteilung'!F13","v":"SV Großefehn"}]
[null,null,null,null,null,null,null,null,null,null,null,null,null,null,"3.",null,{"$f":"'VR Gruppeneinteilung'!F14","v":"VfL \"Fortuna\" Veenhusen 2"}]
[null,null,null,null,null,null,null,null,null,null,null,null,null,null,"4.",null,{"$f":"'VR Gruppeneinteilung'!F15","v":"TuS Strudden 2"}]
[null,null,null,null,null,null,null,null,null,null,null,null,null,null,"5.",null,{"$f":"'VR Gruppeneinteilung'!F16","v":"TSV Barrien"}]
[null,null,null,null,null,null,null,null,null,null,null,null,null,null,"6.",null,{"$f":"'VR Gruppeneinteilung'!F17","v":"TuS Weener"}]
[]
[null,"II. Spielplan"]
[]
[null,"Nr.",null,"Beginn",null,null,null,null,"Spielpaarung",null,null,null,null,null,null,null,null,null,null,null,null,null,null,null,null,null,null,null,null,null,null,null,null,null,null,null,null,null,null,null,null,null,null,null,null,null,null,null,"Ergebnis",null,null,null,null,null,null,null,null,"Punkte"]
[null,1,null,{"$f":"$H$5","v":"14:00:00"},null,null,null,null,{"$f":"$Q$11","v":"VfL Germania Leer"},null,null,null,null,null,null,null,null,null,null,null,null,null,null,null,null,null,null,"-",{"$f":"$Q$12","v":"SV Großefehn"},null,null,null,null,null,null,null,null,null,null,null,null,null,null,null,null,null,null,null,1,null,":",0,null,null,null,null,null,{"$f":"IF(ISBLANK(AW21),\"0\",IF(AW21>AZ21,3,IF(AW21=AZ21,1,0)))","v":3},":",{"$f":"IF(ISBLANK(AZ21),\"0\",IF(AZ21>AW21,3,IF(AZ21=AW21,1,0)))","v":0}]
[null,2,null,{"$f":"D21+$U$5*$X$5+$AL$5","v":"14:17:00"},null,null,null,null,{"$f":"$Q$13","v":"VfL \"Fortuna\" Veenhusen 2"},null,null,null,null,null,null,null,null,null,null,null,null,null,null,null,null,null,null,"-",{"$f":"$Q$14","v":"TuS Strudden 2"},null,null,null,null,null,null,null,null,null,null,null,null,null,null,null,null,null,null,null,0,null,":",2,null,null,null,null,null,{"$f":"IF(ISBLANK(AW22),\"0\",IF(AW22>AZ22,3,IF(AW22=AZ22,1,0)))","v":0},":",{"$f":"IF(ISBLANK(AZ22),\"0\",IF(AZ22>AW22,3,IF(AZ22=AW22,1,0)))","v":3}]
[null,3,null,{"$f":"D22+$U$5*$X$5+$AL$5","v":"14:34:00"},null,null,null,null,{"$f":"$Q$15","v":"TSV Barrien"},null,null,null,null,null,null,null,null,null,null,null,null,null,null,null,null,null,null,"-",{"$f":"$Q$16","v":"TuS Weener"},null,null,null,null,null,null,null,null,null,null,null,null,null,null,null,null,null,null,null,1,null,":",0,null,null,null,null,null,3,":",0]
[null,4,null,"14:51:00",null,null,null,null,{"$f":"$Q$11","v":"VfL Germania Leer"},null,null,null,null,null,null,null,null,null,null,null,null,null,null,null,null,null,null,"-",{"$f":"$Q$13","v":"VfL \"Fortuna\" Veenhusen 2"},null,null,null,null,null,null,null,null,null,null,null,null,null,null,null,null,null,null,null,9,null,":",0,null,null,null,null,null,3,":",0]
[null,5,null,"15:08:00",null,null,null,null,{"$f":"$Q$12","v":"SV Großefehn"},null,null,null,null,null,null,null,null,null,null,null,null,null,null,null,null,null,null,"-",{"$f":"$Q$15","v":"TSV Barrien"},null,null,null,null,null,null,null,null,null,null,null,null,null,null,null,null,null,null,null,1,null,":",1,null,null,null,null,null,1,":",1]
[null,6,null,"15:25:00",null,null,null,null,{"$f":"$Q$14","v":"TuS Strudden 2"},null,null,null,null,null,null,null,null,null,null,null,null,null,null,null,null,null,null,"-",{"$f":"$Q$16","v":"TuS Weener"},null,null,null,null,null,null,null,null,null,null,null,null,null,null,null,null,null,null,null,3,null,":",0,null,null,null,null,null,3,":",0]
[null,7,null,"15:42:00",null,null,null,null,{"$f":"$Q$15","v":"TSV Barrien"},null,null,null,null,null,null,null,null,null,null,null,null,null,null,null,null,null,null,"-",{"$f":"$Q$11","v":"VfL Germania Leer"},null,null,null,null,null,null,null,null,null,null,null,null,null,null,null,null,null,null,null,0,null,":",1,null,null,null,null,null,0,":",3,null,null,null,null,{"$f":"$Q$11","v":"VfL Germania Leer"},{"$f":"COUNT($AW$21,$AW$24,$AZ$27,$AW$30,$AZ$33)","v":5},{"$f":"SUM($BF$21+$BF$24+$BH$27+$BF$30+$BH$33)","v":15},{"$f":"SUM($AW$21+$AW$24+$AZ$27+$AW$30+$AZ$33)","v":21},":",{"$f":"SUM($AZ$21+$AZ$24+$AW$27+$AZ$30+$AW$33)","v":0},{"$f":"SUM(BP27-BR27)","v":21}]
[null,8,null,"15:59:00",null,null,null,null,{"$f":"$Q$12","v":"SV Großefehn"},null,null,null,null,null,null,null,null,null,null,null,null,null,null,null,null,null,null,"-",{"$f":"$Q$14","v":"TuS Strudden 2"},null,null,null,null,null,null,null,null,null,null,null,null,null,null,null,null,null,null,null,4,null,":",0,null,null,null,null,null,3,":",0,null,null,null,null,{"$f":"$Q$15","v":"TSV Barrien"},{"$f":"COUNT($AW$23,$AZ$25,$AW$27,$AZ$32,$AZ$35)","v":5},{"$f":"SUM($BF$23+$BH$25+$BF$27+$BH$32+$BH$35)","v":10},{"$f":"SUM($AW$23+$AZ$25+$AW$27+$AZ$32+$AZ$35)","v":12},":",{"$f":"SUM($AZ$23+$AW$25+$AZ$27+$AW$32+$AW$35)","v":2},10]
[null,9,null,"16:16:00",null,null,null,null,{"$f":"$Q$16","v":"TuS Weener"},null,null,null,null,null,null,null,null,null,null,null,null,null,null,null,null,null,null,"-",{"$f":"$Q$13","v":"VfL \"Fortuna\" Veenhusen 2"},null,null,null,null,null,null,null,null,null,null,null,null,null,null,null,null,null,null,null,3,null,":",0,null,null,null,null,null,3,":",0,null,null,null,null,{"$f":"$Q$12","v":"SV Großefehn"},{"$f":"COUNT($AZ$21,$AW$25,$AW$28,$AZ$31,$AW$34)","v":5},{"$f":"SUM($BH$21+$BF$25+$BF$28+$BH$31+$BF$34)","v":8},{"$f":"SUM($AZ$21+$AW$25+$AW$28+$AZ$31+$AW$34)","v":17},":",{"$f":"SUM($AW$21+$AZ$25+$AZ$28+$AW$31+$AZ$34)","v":4},13]
[null,10,null,"16:33:00",null,null,null,null,{"$f":"$Q$11","v":"VfL Germania Leer"},null,null,null,null,null,null,null,null,null,null,null,null,null,null,null,null,null,null,"-",{"$f":"$Q$14","v":"TuS Strudden 2"},null,null,null,null,null,null,null,null,null,null,null,null,null,null,null,null,null,null,null,6,null,":",0,null,null,null,null,null,3,":",0,null,null,null,null,{"$f":"$Q$14","v":"TuS Strudden 2"},{"$f":"COUNT($AZ$22,$AW$26,$AZ$28,$AZ$30,$AW$35)","v":5},{"$f":"SUM($BH$22+$BF$26+$BH$28+$BH$30+$BF$35)","v":6},{"$f":"SUM($AZ$22+$AW$26+$AZ$28+$AZ$30+$AW$35)","v":5},":",{"$f":"SUM($AW$22+$AZ$26+$AW$28+$AW$30+$AZ$35)","v":13},-8]
[null,11,null,"16:50:00",null,null,null,null,{"$f":"$Q$16","v":"TuS Weener"},null,null,null,null,null,null,null,null,null,null,null,null,null,null,null,null,null,null,"-",{"$f":"$Q$12","v":"SV Großefehn"},null,null,null,null,null,null,null,null,null,null,null,null,null,null,null,null,null,null,null,2,null,":",2,null,null,null,null,null,1,":",1,null,null,null,null,{"$f":"$Q$16","v":"TuS Weener"},{"$f":"COUNT($AZ$23,$AZ$26,$AW$29,$AW$31,$AW$33)","v":5},{"$f":"SUM($BH$23+$BH$26+$BF$29+$BF$31+$BF$33)","v":4},{"$f":"SUM($AZ$23+$AZ$26+$AW$29+$AW$31+$AW$33)","v":5},":",{"$f":"SUM($AW$23+$AW$26+$AZ$29+$AZ$31+$AZ$33)","v":10},-5]
[null,12,null,"17:07:00",null,null,null,null,{"$f":"$Q$13","v":"VfL \"Fortuna\" Veenhusen 2"},null,null,null,null,null,null,null,null,null,null,null,null,null,null,null,null,null,null,"-",{"$f":"$Q$15","v":"TSV Barrien"},null,null,null,null,null,null,null,null,null,null,null,null,null,null,null,null,null,null,null,0,null,":",7,null,null,null,null,null,0,":",3,null,null,null,null,{"$f":"$Q$13","v":"VfL \"Fortuna\" Veenhusen 2"},{"$f":"COUNT($AW$22,$AZ$24,$AZ$29,$AW$32,$AZ$34)","v":5},{"$f":"SUM($BF$22+$BH$24+$BH$29+$BF$32+$BH$34)","v":0},{"$f":"SUM($AW$22+$AZ$24+$AZ$29+$AW$32+$AZ$34)","v":0},":",{"$f":"SUM($AZ$22+$AW$24+$AW$29+$AZ$32+$AW$34)","v":31},-31]
[null,13,null,"17:24:00",null,null,null,null,{"$f":"$Q$16","v":"TuS Weener"},null,null,null,null,null,null,null,null,null,null,null,null,null,null,null,null,null,null,"-",{"$f":"$Q$11","v":"VfL Germania Leer"},null,null,null,null,null,null,null,null,null,null,null,null,null,null,null,null,null,null,null,0,null,":",4,null,null,null,null,null,0,":",3]
[null,14,null,"17:41:00",null,null,null,null,{"$f":"$Q$12","v":"SV Großefehn"},null,null,null,null,null,null,null,null,null,null,null,null,null,null,null,null,null,null,"-",{"$f":"$Q$13","v":"VfL \"Fortuna\" Veenhusen 2"},null,null,null,null,null,null,null,null,null,null,null,null,null,null,null,null,null,null,null,10,null,":",0,null,null,null,null,null,3,":",0]
[null,15,null,"17:58:00",null,null,null,null,{"$f":"$Q$14","v":"TuS Strudden 2"},null,null,null,null,null,null,null,null,null,null,null,null,null,null,null,null,null,null,"-",{"$f":"$Q$15","v":"TSV Barrien"},null,null,null,null,null,null,null,null,null,null,null,null,null,null,null,null,null,null,null,0,null,":",3,null,null,null,null,null,0,":",3]
[]
[null,null,"III. Abschlußtabelle"]
[]
[null,null,null,null,null,null,null,null,"Abschlußtabelle",null,null,null,null,null,null,null,null,null,null,null,null,null,null,null,null,null,null,null,null,null,null,null,null,null,"Sp.",null,null,"Pkt.",null,null,"Tore",null,null,null,null,"Diff."]
[null,null,null,null,null,null,null,null,"1.",null,{"$f":"$BM$27","v":"VfL Germania Leer"},null,null,null,null,null,null,null,null,null,null,null,null,null,null,null,null,null,null,null,null,null,null,null,{"$f":"$BN$27","v":5},null,null,{"$f":"$BO$27","v":15},null,null,{"$f":"$BP$27","v":21},null,":",{"$f":"$BR$27","v":0},null,{"$f":"$BS$27","v":21}]
[null,null,null,null,null,null,null,null,"2.",null,{"$f":"$BM$28","v":"TSV Barrien"},null,null,null,null,null,null,null,null,null,null,null,null,null,null,null,null,null,null,null,null,null,null,null,{"$f":"$BN$28","v":5},null,null,{"$f":"$BO$28","v":10},null,null,{"$f":"$BP$28","v":12},null,":",{"$f":"$BR$28","v":2},null,{"$f":"$BS$28","v":10}]
[null,null,null,null,null,null,null,null,"3.",null,{"$f":"$BM$29","v":"SV Großefehn"},null,null,null,null,null,null,null,null,null,null,null,null,null,null,null,null,null,null,null,null,null,null,null,{"$f":"$BN$29","v":5},null,null,{"$f":"$BO$29","v":8},null,null,{"$f":"$BP$29","v":17},null,":",{"$f":"$BR$29","v":4},null,{"$f":"$BS$29","v":13}]
[null,null,null,null,null,null,null,null,"4.",null,{"$f":"$BM$30","v":"TuS Strudden 2"},null,null,null,null,null,null,null,null,null,null,null,null,null,null,null,null,null,null,null,null,null,null,null,{"$f":"$BN$30","v":5},null,null,{"$f":"$BO$30","v":6},null,null,{"$f":"$BP$30","v":5},null,":",{"$f":"$BR$30","v":13},null,{"$f":"$BS$30","v":-8}]
[null,null,null,null,null,null,null,null,"5.",null,{"$f":"$BM$31","v":"TuS Weener"},null,null,null,null,null,null,null,null,null,null,null,null,null,null,null,null,null,null,null,null,null,null,null,{"$f":"$BN$31","v":5},null,null,{"$f":"$BO$31","v":4},null,null,{"$f":"$BP$31","v":5},null,":",{"$f":"$BR$31","v":10},null,{"$f":"$BS$31","v":-5}]
[null,null,null,null,null,null,null,null,"6.",null,{"$f":"$BM$32","v":"VfL \"Fortuna\" Veenhusen 2"},null,null,null,null,null,null,null,null,null,null,null,null,null,null,null,null,null,null,null,null,null,null,null,{"$f":"$BN$32","v":5},null,null,{"$f":"$BO$32","v":0},null,null,{"$f":"$BP$32","v":0},null,":",{"$f":"$BR$32","v":31},null,{"$f":"$BS$32","v":-31}]

{"sheet":"VR Gruppe E","index":5,"n_rows":45,"n_cols":71,"rows_kept":45,"cut":false,"hidden":false,"merged":[[4,7,4,11],[4,20,4,21],[4,23,4,27],[4,37,4,41],[13,14,13,15],[13,16,13,40],[14,14,14,15],[14,16,14,40],[1,0,1,54],[2,0,2,54],[15,14,15,15],[15,16,15,40],[9,14,9,40],[10,14,10,15],[10,16,10,40],[11,14,11,15],[11,16,11,40],[12,14,12,15],[12,16,12,40],[19,1,19,2],[19,3,19,7],[19,8,19,47],[19,48,19,52],[19,53,19,54],[20,1,20,2],[20,3,20,7],[20,8,20,26],[20,28,20,47],[20,48,20,49],[20,51,20,52],[20,53,20,54],[21,1,21,2],[21,3,21,7],[21,8,21,26],[21,28,21,47],[21,48,21,49],[21,51,21,52],[21,53,21,54],[22,53,22,54],[23,1,23,2],[23,3,23,7],[23,8,23,26],[23,28,23,47],[23,48,23,49],[23,51,23,52],[23,53,23,54],[22,1,22,2],[22,3,22,7],[22,8,22,26],[22,28,22,47],[22,48,22,49],[22,51,22,52],[24,53,24,54],[25,1,25,2],[25,3,25,7],[25,8,25,26],[25,28,25,47],[25,48,25,49],[25,51,25,52],[25,53,25,54],[24,1,24,2],[24,3,24,7],[24,8,24,26],[24,28,24,47],[24,48,24,49],[24,51,24,52],[26,53,26,54],[27,1,27,2],[27,3,27,7],[27,8,27,26],[27,28,27,47],[27,48,27,49],[27,51,27,52],[27,53,27,54],[26,1,26,2],[26,3,26,7],[26,8,26,26],[26,28,26,47],[26,48,26,49],[26,51,26,52],[28,53,28,54],[29,1,29,2],[29,3,29,7],[29,8,29,26],[29,28,29,47],[29,48,29,49],[29,51,29,52],[29,53,29,54],[28,1,28,2],[28,3,28,7],[28,8,28,26],[28,28,28,47],[28,48,28,49],[28,51,28,52],[30,53,30,54],[31,1,31,2],[31,3,31,7],[31,8,31,26],[31,28,31,47],[31,48,31,49],[31,51,31,52],[31,53,31,54],[30,1,30,2],[30,3,30,7],[30,8,30,26],[30,28,30,47],[30,48,30,49],[30,51,30,52],[32,53,32,54],[33,1,33,2],[33,3,33,7],[33,8,33,26],[33,28,33,47],[33,48,33,49],[33,51,33,52],[33,53,33,54],[32,1,32,2],[32,3,32,7],[32,8,32,26],[32,28,32,47],[32,48,32,49],[32,51,32,52],[34,53,34,54],[38,8,38,33],[38,34,38,36],[38,37,38,39],[38,40,38,44],[38,45,38,47],[34,1,34,2],[34,3,34,7],[34,8,34,26],[34,28,34,47],[34,48,34,49],[34,51,34,52],[39,45,39,47],[40,8,40,9],[40,10,40,33],[40,34,40,36],[40,37,40,39],[40,40,40,41],[40,43,40,44],[40,45,40,47],[39,8,39,9],[39,10,39,33],[39,34,39,36],[39,37,39,39],[39,40,39,41],[39,43,39,44],[41,45,41,47],[42,8,42,9],[42,10,42,33],[42,34,42,36],[42,37,42,39],[42,40,42,41],[42,43,42,44],[42,45,42,47],[41,8,41,9],[41,10,41,33],[41,34,41,36],[41,37,41,39],[41,40,41,41],[41,43,41,44],[43,45,43,47],[44,8,44,9],[44,10,44,33],[44,34,44,36],[44,37,44,39],[44,40,44,41],[44,43,44,44],[44,45,44,47],[43,8,43,9],[43,10,43,33],[43,34,43,36],[43,37,43,39],[43,40,43,41],[43,43,43,44]]}
[]
["Vorrunde"]
["Gruppe E"]
[]
[null,null,null,null,null,null,"Beginn:","14:00:00",null,null,null,null,"Uhr",null,null,null,null,null,null,"Spielzeit:",1,null,"x","00:15:00",null,null,null,null,"min",null,null,null,null,null,null,null,"Pause:","00:02:00",null,null,null,null,"min"]
[]
[]
[null,"I. Teilnehmende Mannschaften"]
[]
[null,null,null,null,null,null,null,null,null,null,null,null,null,null,"Gruppeneinteilung"]
[null,null,null,null,null,null,null,null,null,null,null,null,null,null,"1.",null,{"$f":"'VR Gruppeneinteilung'!B21","v":"Weiße Elf Nordhorn"}]
[null,null,null,null,null,null,null,null,null,null,null,null,null,null,"2.",null,{"$f":"'VR Gruppeneinteilung'!B22","v":"SV Wallinghausen"}]
[null,null,null,null,null,null,null,null,null,null,null,null,null,null,"3.",null,{"$f":"'VR Gruppeneinteilung'!B23","v":"SF Oesede"}]
[null,null,null,null,null,null,null,null,null,null,null,null,null,null,"4.",null,{"$f":"'VR Gruppeneinteilung'!B24","v":"SV Spetzerfehn"}]
[null,null,null,null,null,null,null,null,null,null,null,null,null,null,"5.",null,{"$f":"'VR Gruppeneinteilung'!B25","v":"SV Concordia Neermoor"}]
[null,null,null,null,null,null,null,null,null,null,null,null,null,null,"6.",null,{"$f":"'VR Gruppeneinteilung'!B26","v":"TV Apen"}]
[]
[null,"II. Spielplan"]
[]
[null,"Nr.",null,"Beginn",null,null,null,null,"Spielpaarung",null,null,null,null,null,null,null,null,null,null,null,null,null,null,null,null,null,null,null,null,null,null,null,null,null,null,null,null,null,null,null,null,null,null,null,null,null,null,null,"Ergebnis",null,null,null,null,null,null,null,null,"Punkte"]
[null,1,null,{"$f":"$H$5","v":"14:00:00"},null,null,null,null,{"$f":"$Q$11","v":"Weiße Elf Nordhorn"},null,null,null,null,null,null,null,null,null,null,null,null,null,null,null,null,null,null,"-",{"$f":"$Q$12","v":"SV Wallinghausen"},null,null,null,null,null,null,null,null,null,null,null,null,null,null,null,null,null,null,null,2,null,":",0,null,null,null,null,null,{"$f":"IF(ISBLANK(AW21),\"0\",IF(AW21>AZ21,3,IF(AW21=AZ21,1,0)))","v":3},":",{"$f":"IF(ISBLANK(AZ21),\"0\",IF(AZ21>AW21,3,IF(AZ21=AW21,1,0)))","v":0}]
[null,2,null,{"$f":"D21+$U$5*$X$5+$AL$5","v":"14:17:00"},null,null,null,null,{"$f":"$Q$13","v":"SF Oesede"},null,null,null,null,null,null,null,null,null,null,null,null,null,null,null,null,null,null,"-",{"$f":"$Q$14","v":"SV Spetzerfehn"},null,null,null,null,null,null,null,null,null,null,null,null,null,null,null,null,null,null,null,5,null,":",0,null,null,null,null,null,{"$f":"IF(ISBLANK(AW22),\"0\",IF(AW22>AZ22,3,IF(AW22=AZ22,1,0)))","v":3},":",{"$f":"IF(ISBLANK(AZ22),\"0\",IF(AZ22>AW22,3,IF(AZ22=AW22,1,0)))","v":0}]
[null,3,null,{"$f":"D22+$U$5*$X$5+$AL$5","v":"14:34:00"},null,null,null,null,{"$f":"$Q$15","v":"SV Concordia Neermoor"},null,null,null,null,null,null,null,null,null,null,null,null,null,null,null,null,null,null,"-",{"$f":"$Q$16","v":"TV Apen"},null,null,null,null,null,null,null,null,null,null,null,null,null,null,null,null,null,null,null,2,null,":",5,null,null,null,null,null,0,":",3]
[null,4,null,"14:51:00",null,null,null,null,{"$f":"$Q$11","v":"Weiße Elf Nordhorn"},null,null,null,null,null,null,null,null,null,null,null,null,null,null,null,null,null,null,"-",{"$f":"$Q$13","v":"SF Oesede"},null,null,null,null,null,null,null,null,null,null,null,null,null,null,null,null,null,null,null,0,null,":",1,null,null,null,null,null,0,":",3]
[null,5,null,"15:08:00",null,null,null,null,{"$f":"$Q$12","v":"SV Wallinghausen"},null,null,null,null,null,null,null,null,null,null,null,null,null,null,null,null,null,null,"-",{"$f":"$Q$15","v":"SV Concordia Neermoor"},null,null,null,null,null,null,null,null,null,null,null,null,null,null,null,null,null,null,null,0,null,":",0,null,null,null,null,null,1,":",1]
[null,6,null,"15:25:00",null,null,null,null,{"$f":"$Q$14","v":"SV Spetzerfehn"},null,null,null,null,null,null,null,null,null,null,null,null,null,null,null,null,null,null,"-",{"$f":"$Q$16","v":"TV Apen"},null,null,null,null,null,null,null,null,null,null,null,null,null,null,null,null,null,null,null,1,null,":",3,null,null,null,null,null,0,":",3]
[null,7,null,"15:42:00",null,null,null,null,{"$f":"$Q$15","v":"SV Concordia Neermoor"},null,null,null,null,null,null,null,null,null,null,null,null,null,null,null,null,null,null,"-",{"$f":"$Q$11","v":"Weiße Elf Nordhorn"},null,null,null,null,null,null,null,null,null,null,null,null,null,null,null,null,null,null,null,0,null,":",5,null,null,null,null,null,0,":",3,null,null,null,null,{"$f":"$Q$13","v":"SF Oesede"},{"$f":"COUNT($AW$22,$AZ$24,$AZ$29,$AW$32,$AZ$34)","v":5},{"$f":"SUM($BF$22+$BH$24+$BH$29+$BF$32+$BH$34)","v":15},{"$f":"SUM($AW$22+$AZ$24+$AZ$29+$AW$32+$AZ$34)","v":16},":",{"$f":"SUM($AZ$22+$AW$24+$AW$29+$AZ$32+$AW$34)","v":0},{"$f":"SUM(BP27-BR27)","v":16}]
[null,8,null,"15:59:00",null,null,null,null,{"$f":"$Q$12","v":"SV Wallinghausen"},null,null,null,null,null,null,null,null,null,null,null,null,null,null,null,null,null,null,"-",{"$f":"$Q$14","v":"SV Spetzerfehn"},null,null,null,null,null,null,null,null,null,null,null,null,null,null,null,null,null,null,null,2,null,":",3,null,null,null,null,null,0,":",3,null,null,null,null,{"$f":"$Q$11","v":"Weiße Elf Nordhorn"},{"$f":"COUNT($AW$21,$AW$24,$AZ$27,$AW$30,$AZ$33)","v":5},{"$f":"SUM($BF$21+$BF$24+$BH$27+$BF$30+$BH$33)","v":12},{"$f":"SUM($AW$21+$AW$24+$AZ$27+$AW$30+$AZ$33)","v":16},":",{"$f":"SUM($AZ$21+$AZ$24+$AW$27+$AZ$30+$AW$33)","v":2},14]
[null,9,null,"16:16:00",null,null,null,null,{"$f":"$Q$16","v":"TV Apen"},null,null,null,null,null,null,null,null,null,null,null,null,null,null,null,null,null,null,"-",{"$f":"$Q$13","v":"SF Oesede"},null,null,null,null,null,null,null,null,null,null,null,null,null,null,null,null,null,null,null,0,null,":",5,null,null,null,null,null,0,":",3,null,null,null,null,{"$f":"$Q$16","v":"TV Apen"},{"$f":"COUNT($AZ$23,$AZ$26,$AW$29,$AW$31,$AW$33)","v":5},{"$f":"SUM($BH$23+$BH$26+$BF$29+$BF$31+$BF$33)","v":9},{"$f":"SUM($AZ$23+$AZ$26+$AW$29+$AW$31+$AW$33)","v":12},":",{"$f":"SUM($AW$23+$AW$26+$AZ$29+$AZ$31+$AZ$33)","v":11},1]
[null,10,null,"16:33:00",null,null,null,null,{"$f":"$Q$11","v":"Weiße Elf Nordhorn"},null,null,null,null,null,null,null,null,null,null,null,null,null,null,null,null,null,null,"-",{"$f":"$Q$14","v":"SV Spetzerfehn"},null,null,null,null,null,null,null,null,null,null,null,null,null,null,null,null,null,null,null,6,null,":",0,null,null,null,null,null,3,":",0,null,null,null,null,{"$f":"$Q$14","v":"SV Spetzerfehn"},{"$f":"COUNT($AZ$22,$AW$26,$AZ$28,$AZ$30,$AW$35)","v":5},{"$f":"SUM($BH$22+$BF$26+$BH$28+$BH$30+$BF$35)","v":6},{"$f":"SUM($AZ$22+$AW$26+$AZ$28+$AZ$30+$AW$35)","v":5},":",{"$f":"SUM($AW$22+$AZ$26+$AW$28+$AW$30+$AZ$35)","v":16},-11]
[null,11,null,"16:50:00",null,null,null,null,{"$f":"$Q$16","v":"TV Apen"},null,null,null,null,null,null,null,null,null,null,null,null,null,null,null,null,null,null,"-",{"$f":"$Q$12","v":"SV Wallinghausen"},null,null,null,null,null,null,null,null,null,null,null,null,null,null,null,null,null,null,null,3,null,":",0,null,null,null,null,null,3,":",0,null,null,null,null,{"$f":"$Q$12","v":"SV Wallinghausen"},{"$f":"COUNT($AZ$21,$AW$25,$AW$28,$AZ$31,$AW$34)","v":5},{"$f":"SUM($BH$21+$BF$25+$BF$28+$BH$31+$BF$34)","v":1},{"$f":"SUM($AZ$21+$AW$25+$AW$28+$AZ$31+$AW$34)","v":2},":",{"$f":"SUM($AW$21+$AZ$25+$AZ$28+$AW$31+$AZ$34)","v":11},-9]
[null,12,null,"17:07:00",null,null,null,null,{"$f":"$Q$13","v":"SF Oesede"},null,null,null,null,null,null,null,null,null,null,null,null,null,null,null,null,null,null,"-",{"$f":"$Q$15","v":"SV Concordia Neermoor"},null,null,null,null,null,null,null,null,null,null,null,null,null,null,null,null,null,null,null,2,null,":",0,null,null,null,null,null,3,":",0,null,null,null,null,{"$f":"$Q$15","v":"SV Concordia Neermoor"},{"$f":"COUNT($AW$23,$AZ$25,$AW$27,$AZ$32,$AZ$35)","v":5},{"$f":"SUM($BF$23+$BH$25+$BF$27+$BH$32+$BH$35)","v":1},{"$f":"SUM($AW$23+$AZ$25+$AW$27+$AZ$32+$AZ$35)","v":2},":",{"$f":"SUM($AZ$23+$AW$25+$AZ$27+$AW$32+$AW$35)","v":13},-11]
[null,13,null,"17:24:00",null,null,null,null,{"$f":"$Q$16","v":"TV Apen"},null,null,null,null,null,null,null,null,null,null,null,null,null,null,null,null,null,null,"-",{"$f":"$Q$11","v":"Weiße Elf Nordhorn"},null,null,null,null,null,null,null,null,null,null,null,null,null,null,null,null,null,null,null,1,null,":",3,null,null,null,null,null,0,":",3]
[null,14,null,"17:41:00",null,null,null,null,{"$f":"$Q$12","v":"SV Wallinghausen"},null,null,null,null,null,null,null,null,null,null,null,null,null,null,null,null,null,null,"-",{"$f":"$Q$13","v":"SF Oesede"},null,null,null,null,null,null,null,null,null,null,null,null,null,null,null,null,null,null,null,0,null,":",3,null,null,null,null,null,0,":",3]
[null,15,null,"17:58:00",null,null,null,null,{"$f":"$Q$14","v":"SV Spetzerfehn"},null,null,null,null,null,null,null,null,null,null,null,null,null,null,null,null,null,null,"-",{"$f":"$Q$15","v":"SV Concordia Neermoor"},null,null,null,null,null,null,null,null,null,null,null,null,null,null,null,null,null,null,null,1,null,":",0,null,null,null,null,null,3,":",0]
[]
[null,null,"III. Abschlußtabelle"]
[]
[null,null,null,null,null,null,null,null,"Abschlußtabelle",null,null,null,null,null,null,null,null,null,null,null,null,null,null,null,null,null,null,null,null,null,null,null,null,null,"Sp.",null,null,"Pkt.",null,null,"Tore",null,null,null,null,"Diff."]
[null,null,null,null,null,null,null,null,"1.",null,{"$f":"$BM$27","v":"SF Oesede"},null,null,null,null,null,null,null,null,null,null,null,null,null,null,null,null,null,null,null,null,null,null,null,{"$f":"$BN$27","v":5},null,null,{"$f":"$BO$27","v":15},null,null,{"$f":"$BP$27","v":16},null,":",{"$f":"$BR$27","v":0},null,{"$f":"$BS$27","v":16}]
[null,null,null,null,null,null,null,null,"2.",null,{"$f":"$BM$28","v":"Weiße Elf Nordhorn"},null,null,null,null,null,null,null,null,null,null,null,null,null,null,null,null,null,null,null,null,null,null,null,{"$f":"$BN$28","v":5},null,null,{"$f":"$BO$28","v":12},null,null,{"$f":"$BP$28","v":16},null,":",{"$f":"$BR$28","v":2},null,{"$f":"$BS$28","v":14}]
[null,null,null,null,null,null,null,null,"3.",null,{"$f":"$BM$29","v":"TV Apen"},null,null,null,null,null,null,null,null,null,null,null,null,null,null,null,null,null,null,null,null,null,null,null,{"$f":"$BN$29","v":5},null,null,{"$f":"$BO$29","v":9},null,null,{"$f":"$BP$29","v":12},null,":",{"$f":"$BR$29","v":11},null,{"$f":"$BS$29","v":1}]
[null,null,null,null,null,null,null,null,"4.",null,{"$f":"$BM$30","v":"SV Spetzerfehn"},null,null,null,null,null,null,null,null,null,null,null,null,null,null,null,null,null,null,null,null,null,null,null,{"$f":"$BN$30","v":5},null,null,{"$f":"$BO$30","v":6},null,null,{"$f":"$BP$30","v":5},null,":",{"$f":"$BR$30","v":16},null,{"$f":"$BS$30","v":-11}]
[null,null,null,null,null,null,null,null,"5.",null,{"$f":"$BM$31","v":"SV Wallinghausen"},null,null,null,null,null,null,null,null,null,null,null,null,null,null,null,null,null,null,null,null,null,null,null,{"$f":"$BN$31","v":5},null,null,{"$f":"$BO$31","v":1},null,null,{"$f":"$BP$31","v":2},null,":",{"$f":"$BR$31","v":11},null,{"$f":"$BS$31","v":-9}]
[null,null,null,null,null,null,null,null,"6.",null,{"$f":"$BM$32","v":"SV Concordia Neermoor"},null,null,null,null,null,null,null,null,null,null,null,null,null,null,null,null,null,null,null,null,null,null,null,{"$f":"$BN$32","v":5},null,null,{"$f":"$BO$32","v":1},null,null,{"$f":"$BP$32","v":2},null,":",{"$f":"$BR$32","v":13},null,{"$f":"$BS$32","v":-11}]

{"sheet":"ZR Gruppeneinteilung","index":6,"n_rows":7,"n_cols":7,"rows_kept":7,"cut":false,"hidden":false,"merged":[[1,0,1,1],[1,4,1,5]]}
[]
["ZR Gruppe A (1. und 2. Gruppe A und C und 2. Gruppe E)",null,"Platz",null,"ZR Gruppe B (1. und 2. Gruppe B und D und 1. Gruppe E)",null,"Platz"]
["1.",{"$f":"'VR Gruppe A'!K40","v":"BW Papenburg"},1,null,"1.",{"$f":"'VR Gruppe B'!K40","v":"JSG Riede/Emtinghausen 1"},2]
["2.",{"$f":"'VR Gruppe A'!K41","v":"VfL Viktoria Flachsmeer"},1,null,"2.",{"$f":"'VR Gruppe B'!K41","v":"Frisia Loga"},2]
["3.",{"$f":"'VR Gruppe C'!K40","v":"TV Jahn Delmenhorst"},1,null,"3.",{"$f":"'VR Gruppe D'!K40","v":"VfL Germania Leer"},2]
[4,{"$f":"'VR Gruppe C'!K41","v":"VfL \"Fortuna\" Veenhusen 1"},1,null,4,{"$f":"'VR Gruppe D'!K41","v":"TSV Barrien"},2]
[5,{"$f":"'VR Gruppe E'!$K$41","v":"Weiße Elf Nordhorn"},1,null,5,{"$f":"'VR Gruppe E'!$K$40","v":"SF Oesede"},2]

{"sheet":"ZR Gruppe A","index":7,"n_rows":41,"n_cols":71,"rows_kept":41,"cut":false,"hidden":false,"merged":[[2,0,2,53],[1,0,1,53],[14,13,14,14],[14,15,14,35],[14,36,14,37],[12,36,12,37],[13,13,13,14],[13,15,13,35],[13,36,13,37],[11,15,11,35],[11,36,11,37],[4,7,4,11],[4,20,4,21],[4,23,4,27],[4,37,4,41],[18,48,18,52],[18,53,18,54],[9,13,9,35],[9,36,9,37],[10,13,10,14],[10,15,10,35],[10,36,10,37],[11,13,11,14],[19,1,19,2],[19,3,19,5],[19,6,19,8],[19,9,19,13],[19,14,19,29],[19,31,19,47],[19,48,19,49],[19,51,19,52],[19,53,19,54],[18,1,18,2],[18,3,18,5],[18,6,18,8],[18,9,18,13],[18,14,18,47],[12,13,12,14],[12,15,12,35],[20,1,20,2],[20,3,20,5],[20,6,20,8],[20,9,20,13],[20,14,20,29],[20,31,20,47],[20,48,20,49],[20,51,20,52],[20,53,20,54],[21,48,21,49],[21,51,21,52],[21,53,21,54],[22,1,22,2],[22,3,22,5],[22,6,22,8],[22,9,22,13],[22,14,22,29],[22,31,22,47],[22,48,22,49],[21,1,21,2],[21,3,21,5],[21,6,21,8],[21,9,21,13],[21,14,21,29],[21,31,21,47],[22,51,22,52],[22,53,22,54],[23,1,23,2],[23,3,23,5],[23,6,23,8],[23,9,23,13],[23,14,23,29],[23,31,23,47],[23,48,23,49],[23,51,23,52],[23,53,23,54],[24,1,24,2],[24,3,24,5],[24,6,24,8],[24,9,24,13],[24,14,24,29],[24,31,24,47],[24,48,24,49],[24,51,24,52],[24,53,24,54],[25,48,25,49],[25,51,25,52],[25,53,25,54],[26,1,26,2],[26,3,26,5],[26,6,26,8],[26,9,26,13],[26,14,26,29],[26,31,26,47],[26,48,26,49],[25,1,25,2],[25,3,25,5],[25,6,25,8],[25,9,25,13],[25,14,25,29],[25,31,25,47],[26,51,26,52],[26,53,26,54],[27,1,27,2],[27,3,27,5],[27,6,27,8],[27,9,27,13],[27,14,27,29],[27,31,27,47],[27,48,27,49],[27,51,27,52],[27,53,27,54],[28,1,28,2],[28,3,28,5],[28,6,28,8],[28,9,28,13],[28,14,28,29],[28,31,28,47],[28,48,28,49],[28,51,28,52],[28,53,28,54],[35,8,35,9],[35,10,35,32],[33,8,33,32],[33,33,33,35],[33,36,33,38],[33,39,33,43],[33,44,33,46],[34,8,34,9],[34,10,34,32],[34,33,34,35],[34,36,34,38],[34,39,34,40],[34,42,34,43],[34,44,34,46],[35,33,35,35],[35,36,35,38],[35,39,35,40],[35,42,35,43],[35,44,35,46],[38,44,38,46],[38,8,38,9],[38,10,38,32],[38,33,38,35],[38,36,38,38],[38,39,38,40],[38,42,38,43],[36,44,36,46],[37,8,37,9],[37,10,37,32],[37,33,37,35],[37,36,37,38],[37,39,37,40],[37,42,37,43],[37,44,37,46],[36,8,36,9],[36,10,36,32],[36,33,36,35],[36,36,36,38],[36,39,36,40],[36,42,36,43]]}
[]
["Zwischenrunde"]
["Gruppe A"]
[]
[null,null,null,null,null,null,"Beginn:","10:00:00",null,null,null,null,"Uhr",null,null,null,null,null,null,"Spielzeit",1,"1x","x","00:12:00",null,null,null,null,"min",null,null,null,null,null,null,null,"Pause:","00:02:00",null,null,null,null,"min"]
[]
[]
[null,"I. Teilnehmende Mannschaften"]
[]
[null,null,null,null,null,null,null,null,null,null,null,null,null,"Gruppeneinteilung",null,null,null,null,null,null,null,null,null,null,null,null,null,null,null,null,null,null,null,null,null,null,"PL"]
[null,null,null,null,null,null,null,null,null,null,null,null,null,"1.",null,{"$f":"'ZR Gruppeneinteilung'!B3","v":"BW Papenburg"},null,null,null,null,null,null,null,null,null,null,null,null,null,null,null,null,null,null,null,null,1]
[null,null,null,null,null,null,null,null,null,null,null,null,null,"2.",null,{"$f":"'ZR Gruppeneinteilung'!B4","v":"VfL Viktoria Flachsmeer"},null,null,null,null,null,null,null,null,null,null,null,null,null,null,null,null,null,null,null,null,1]
[null,null,null,null,null,null,null,null,null,null,null,null,null,"3.",null,{"$f":"'ZR Gruppeneinteilung'!B5","v":"TV Jahn Delmenhorst"},null,null,null,null,null,null,null,null,null,null,null,null,null,null,null,null,null,null,null,null,1,null,null,null,null,null,null,null,null,null,null,null,null,null,null,null," "]
[null,null,null,null,null,null,null,null,null,null,null,null,null,"4.",null,{"$f":"'ZR Gruppeneinteilung'!B6","v":"VfL \"Fortuna\" Veenhusen 1"},null,null,null,null,null,null,null,null,null,null,null,null,null,null,null,null,null,null,null,null,1]
[null,null,null,null,null,null,null,null,null,null,null,null,null,"5.",null,{"$f":"'ZR Gruppeneinteilung'!B7","v":"Weiße Elf Nordhorn"},null,null,null,null,null,null,null,null,null,null,null,null,null,null,null,null,null,null,null,null,1]
[]
[null,"II. Spielplan"]
[]
[null,"Nr.",null,"Platz",null,null,null,null,null,"Beginn",null,null,null,null,"Spielpaarungen",null,null,null,null,null,null,null,null,null,null,null,null,null,null,null,null,null,null,null,null,null,null,null,null,null,null,null,null,null,null,null,null,null,"Ergebisse",null,null,null,null,"PL",null,null,null,"Punkte"]
[null,1,null,1,null,null,null,null,null,{"$f":"$H$5","v":"10:00:00"},null,null,null,null,{"$f":"P11","v":"BW Papenburg"},null,null,null,null,null,null,null,null,null,null,null,null,null,null,null,"-",{"$f":"P12","v":"VfL Viktoria Flachsmeer"},null,null,null,null,null,null,null,null,null,null,null,null,null,null,null,null,1,null,":",0,null,1,null,null,null,{"$f":"IF(ISBLANK(AW20),\"0\",IF(AW20>AZ20,3,IF(AW20=AZ20,1,0)))","v":3},":",{"$f":"IF(ISBLANK(AZ20),\"0\",IF(AZ20>AW20,3,IF(AZ20=AW20,1,0)))","v":0},null,null,null,null,{"$f":"$P$15","v":"Weiße Elf Nordhorn"},{"$f":"COUNT($BF$22,$BH$24,$BH$27,$BF$29)","v":4},{"$f":"SUM($BF$22+$BH$24+$BH$27+$BF$29)","v":10},{"$f":"SUM($AW$22+$AZ$24+$AZ$27+$AW$29)","v":14},":",{"$f":"SUM($AZ$22+$AW$24+$AW$27+$AZ$29)","v":0},{"$f":"SUM(BP20-BR20)","v":14}]
[null,2,null,1,null,null,null,null,null,{"$f":"J20+$U$5*$X$5+$AL$5","v":"10:14:00"},null,null,null,null,{"$f":"P13","v":"TV Jahn Delmenhorst"},null,null,null,null,null,null,null,null,null,null,null,null,null,null,null,"-",{"$f":"P14","v":"VfL \"Fortuna\" Veenhusen 1"},null,null,null,null,null,null,null,null,null,null,null,null,null,null,null,null,4,null,":",0,null,1,null,null,null,{"$f":"IF(ISBLANK(AW21),\"0\",IF(AW21>AZ21,3,IF(AW21=AZ21,1,0)))","v":3},":",{"$f":"IF(ISBLANK(AZ21),\"0\",IF(AZ21>AW21,3,IF(AZ21=AW21,1,0)))","v":0},null,null,null,null,{"$f":"$P$11","v":"BW Papenburg"},{"$f":"COUNT($BF$20,$BH$22,$BF$25,$BH$28)","v":4},{"$f":"SUM($BF$20+$BH$22+$BF$25+$BH$28)","v":8},{"$f":"SUM($AW$20+$AZ$22+$AW$25+$AZ$28)","v":5},":",{"$f":"SUM($AZ$20+$AW$22+$AZ$25+$AW$28)","v":0},{"$f":"SUM(BP21-BR21)","v":5}]
[null,3,null,1,null,null,null,null,null,{"$f":"J21+$U$5*$X$5+$AL$5","v":"10:28:00"},null,null,null,null,{"$f":"P15","v":"Weiße Elf Nordhorn"},null,null,null,null,null,null,null,null,null,null,null,null,null,null,null,"-",{"$f":"P11","v":"BW Papenburg"},null,null,null,null,null,null,null,null,null,null,null,null,null,null,null,null,0,null,":",0,null,1,null,null,null,1,":",1,null,null,null,null,{"$f":"$P$13","v":"TV Jahn Delmenhorst"},{"$f":"COUNT($BF$21,$BH$23,$BH$25,$BF$27)","v":4},{"$f":"SUM($BF$21+$BH$23+$BH$25+$BF$27)","v":7},{"$f":"SUM($AW$21+$AZ$23+$AZ$25+$AW$27)","v":6},":",{"$f":"SUM($AZ$21+$AW$23+$AW$25+$AZ$27)","v":1},{"$f":"SUM(BP22-BR22)","v":5}]
[null,4,null,1,null,null,null,null,null,"10:42:00",null,null,null,null,{"$f":"P12","v":"VfL Viktoria Flachsmeer"},null,null,null,null,null,null,null,null,null,null,null,null,null,null,null,"-",{"$f":"P13","v":"TV Jahn Delmenhorst"},null,null,null,null,null,null,null,null,null,null,null,null,null,null,null,null,0,null,":",2,null,1,null,null,null,0,":",3,null,null,null,null,{"$f":"$P$14","v":"VfL \"Fortuna\" Veenhusen 1"},{"$f":"COUNT($BH$21,$BF$24,$BH$26,$BF$28)","v":4},{"$f":"SUM($BH$21+$BF$24+$BH$26+$BF$28)","v":3},{"$f":"SUM($AZ$21+$AW$24+$AZ$26+$AW$28)","v":3},":",{"$f":"SUM($AW$21+$AZ$24+$AW$26+$AZ$28)","v":13},{"$f":"SUM(BP23-BR23)","v":-10}]
[null,5,null,1,null,null,null,null,null,"10:56:00",null,null,null,null,{"$f":"P14","v":"VfL \"Fortuna\" Veenhusen 1"},null,null,null,null,null,null,null,null,null,null,null,null,null,null,null,"-",{"$f":"P15","v":"Weiße Elf Nordhorn"},null,null,null,null,null,null,null,null,null,null,null,null,null,null,null,null,0,null,":",5,null,1,null,null,null,0,":",3,null,null,null,null,{"$f":"$P$12","v":"VfL Viktoria Flachsmeer"},{"$f":"COUNT($BH$20,$BF$23,$BF$26,$BH$29)","v":4},{"$f":"SUM($BH$20+$BF$23+$BF$26+$BH$29)","v":0},{"$f":"SUM($AZ$20+$AW$23+$AW$26+$AZ$29)","v":0},":",{"$f":"SUM($AW$20+$AZ$23+$AZ$26+$AW$29)","v":14},{"$f":"SUM(BP24-BR24)","v":-14}]
[null,6,null,1,null,null,null,null,null,"11:10:00",null,null,null,null,{"$f":"P11","v":"BW Papenburg"},null,null,null,null,null,null,null,null,null,null,null,null,null,null,null,"-",{"$f":"P13","v":"TV Jahn Delmenhorst"},null,null,null,null,null,null,null,null,null,null,null,null,null,null,null,null,0,null,":",0,null,1,null,null,null,1,":",1]
[null,7,null,1,null,null,null,null,null,"11:24:00",null,null,null,null,{"$f":"P12","v":"VfL Viktoria Flachsmeer"},null,null,null,null,null,null,null,null,null,null,null,null,null,null,null,"-",{"$f":"P14","v":"VfL \"Fortuna\" Veenhusen 1"},null,null,null,null,null,null,null,null,null,null,null,null,null,null,null,null,0,null,":",3,null,1,null,null,null,0,":",3]
[null,8,null,1,null,null,null,null,null,"12:30:00",null,null,null,null,{"$f":"P13","v":"TV Jahn Delmenhorst"},null,null,null,null,null,null,null,null,null,null,null,null,null,null,null,"-",{"$f":"P15","v":"Weiße Elf Nordhorn"},null,null,null,null,null,null,null,null,null,null,null,null,null,null,null,null,0,null,":",1,null,1,null,null,null,0,":",3]
[null,9,null,1,null,null,null,null,null,"12:44:00",null,null,null,null,{"$f":"P14","v":"VfL \"Fortuna\" Veenhusen 1"},null,null,null,null,null,null,null,null,null,null,null,null,null,null,null,"-",{"$f":"P11","v":"BW Papenburg"},null,null,null,null,null,null,null,null,null,null,null,null,null,null,null,null,0,null,":",4,null,1,null,null,null,0,":",3]
[null,10,null,1,null,null,null,null,null,"12:58:00",null,null,null,null,{"$f":"P15","v":"Weiße Elf Nordhorn"},null,null,null,null,null,null,null,null,null,null,null,null,null,null,null,"-",{"$f":"P12","v":"VfL Viktoria Flachsmeer"},null,null,null,null,null,null,null,null,null,null,null,null,null,null,null,null,8,null,":",0,null,1,null,null,null,3,":",0]
[]
[null,"III. Abschlusstabelle"]
[]
[]
[null,null,null,null,null,null,null,null,"Mannschaften",null,null,null,null,null,null,null,null,null,null,null,null,null,null,null,null,null,null,null,null,null,null,null,null,"Sp.",null,null,"Pkt.",null,null,"Tore",null,null,null,null,"Diff."]
[null,null,null,null,null,null,null,null,"1.",null,{"$f":"BM20","v":"Weiße Elf Nordhorn"},null,null,null,null,null,null,null,null,null,null,null,null,null,null,null,null,null,null,null,null,null,null,{"$f":"BN20","v":4},null,null,{"$f":"BO20","v":10},null,null,{"$f":"BP20","v":14},null,":",{"$f":"BR20","v":0},null,{"$f":"BS20","v":14}]
[null,null,null,null,null,null,null,null,"2.",null,{"$f":"BM21","v":"BW Papenburg"},null,null,null,null,null,null,null,null,null,null,null,null,null,null,null,null,null,null,null,null,null,null,{"$f":"BN21","v":4},null,null,{"$f":"BO21","v":8},null,null,{"$f":"BP21","v":5},null,":",{"$f":"BR21","v":0},null,{"$f":"BS21","v":5}]
[null,null,null,null,null,null,null,null,"3.",null,"TV Jahn Delmenhorst",null,null,null,null,null,null,null,null,null,null,null,null,null,null,null,null,null,null,null,null,null,null,4,null,null,7,null,null,6,null,":",1,null,5]
[null,null,null,null,null,null,null,null,"4.",null,"VfL \"Fortuna\" Veenhusen 1",null,null,null,null,null,null,null,null,null,null,null,null,null,null,null,null,null,null,null,null,null,null,4,null,null,3,null,null,3,null,":",13,null,-10]
[null,null,null,null,null,null,null,null,"5.",null,"VfL Viktoria Flachsmeer",null,null,null,null,null,null,null,null,null,null,null,null,null,null,null,null,null,null,null,null,null,null,4,null,null,0,null,null,0,null,":",14,null,-14]
[]
["Achtung! Mittagspause zwischen Spiel 7 und 8 !"]

{"sheet":"ZR Gruppe B","index":8,"n_rows":41,"n_cols":71,"rows_kept":41,"cut":false,"hidden":false,"merged":[[1,0,1,54],[2,0,2,54],[14,13,14,14],[14,15,14,35],[14,36,14,37],[12,36,12,37],[13,13,13,14],[13,15,13,35],[13,36,13,37],[11,15,11,35],[11,36,11,37],[4,7,4,11],[4,20,4,21],[4,23,4,27],[4,37,4,41],[18,48,18,52],[18,53,18,54],[9,13,9,35],[9,36,9,37],[10,13,10,14],[10,15,10,35],[10,36,10,37],[11,13,11,14],[19,1,19,2],[19,3,19,5],[19,6,19,8],[19,9,19,13],[19,14,19,29],[19,31,19,47],[19,48,19,49],[19,51,19,52],[19,53,19,54],[18,1,18,2],[18,3,18,5],[18,6,18,8],[18,9,18,13],[18,14,18,47],[12,13,12,14],[12,15,12,35],[20,1,20,2],[20,3,20,5],[20,6,20,8],[20,9,20,13],[20,14,20,29],[20,31,20,47],[20,48,20,49],[20,51,20,52],[20,53,20,54],[21,48,21,49],[21,51,21,52],[21,53,21,54],[22,1,22,2],[22,3,22,5],[22,6,22,8],[22,9,22,13],[22,14,22,29],[22,31,22,47],[22,48,22,49],[21,1,21,2],[21,3,21,5],[21,6,21,8],[21,9,21,13],[21,14,21,29],[21,31,21,47],[22,51,22,52],[22,53,22,54],[23,1,23,2],[23,3,23,5],[23,6,23,8],[23,9,23,13],[23,14,23,29],[23,31,23,47],[23,48,23,49],[23,51,23,52],[23,53,23,54],[24,1,24,2],[24,3,24,5],[24,6,24,8],[24,9,24,13],[24,14,24,29],[24,31,24,47],[24,48,24,49],[24,51,24,52],[24,53,24,54],[25,48,25,49],[25,51,25,52],[25,53,25,54],[26,1,26,2],[26,3,26,5],[26,6,26,8],[26,9,26,13],[26,14,26,29],[26,31,26,47],[26,48,26,49],[25,1,25,2],[25,3,25,5],[25,6,25,8],[25,9,25,13],[25,14,25,29],[25,31,25,47],[26,51,26,52],[26,53,26,54],[27,1,27,2],[27,3,27,5],[27,6,27,8],[27,9,27,13],[27,14,27,29],[27,31,27,47],[27,48,27,49],[27,51,27,52],[27,53,27,54],[28,1,28,2],[28,3,28,5],[28,6,28,8],[28,9,28,13],[28,14,28,29],[28,31,28,47],[28,48,28,49],[28,51,28,52],[28,53,28,54],[35,8,35,9],[35,10,35,32],[33,8,33,32],[33,33,33,35],[33,36,33,38],[33,39,33,43],[33,44,33,46],[34,8,34,9],[34,10,34,32],[34,33,34,35],[34,36,34,38],[34,39,34,40],[34,42,34,43],[34,44,34,46],[35,33,35,35],[35,36,35,38],[35,39,35,40],[35,42,35,43],[35,44,35,46],[38,44,38,46],[38,8,38,9],[38,10,38,32],[38,33,38,35],[38,36,38,38],[38,39,38,40],[38,42,38,43],[36,44,36,46],[37,8,37,9],[37,10,37,32],[37,33,37,35],[37,36,37,38],[37,39,37,40],[37,42,37,43],[37,44,37,46],[36,8,36,9],[36,10,36,32],[36,33,36,35],[36,36,36,38],[36,39,36,40],[36,42,36,43]]}
[]
["Zwischenrunde"]
["Gruppe B"]
[]
[null,null,null,null,null,null,"Beginn:","10:00:00",null,null,null,null,"Uhr",null,null,null,null,null,null,"Spielzeit",1,"1x","x","00:12:00",null,null,null,null,"min",null,null,null,null,null,null,null,"Pause:","00:02:00",null,null,null,null,"min"]
[]
[]
[null,"I. Teilnehmende Mannschaften"]
[]
[null,null,null,null,null,null,null,null,null,null,null,null,null,"Gruppeneinteilung",null,null,null,null,null,null,null,null,null,null,null,null,null,null,null,null,null,null,null,null,null,null,"PL"]
[null,null,null,null,null,null,null,null,null,null,null,null,null,"1.",null,{"$f":"'ZR Gruppeneinteilung'!F3","v":"JSG Riede/Emtinghausen 1"},null,null,null,null,null,null,null,null,null,null,null,null,null,null,null,null,null,null,null,null,2]
[null,null,null,null,null,null,null,null,null,null,null,null,null,"2.",null,{"$f":"'ZR Gruppeneinteilung'!F4","v":"Frisia Loga"},null,null,null,null,null,null,null,null,null,null,null,null,null,null,null,null,null,null,null,null,2]
[null,null,null,null,null,null,null,null,null,null,null,null,null,"3.",null,{"$f":"'ZR Gruppeneinteilung'!F5","v":"VfL Germania Leer"},null,null,null,null,null,null,null,null,null,null,null,null,null,null,null,null,null,null,null,null,2]
[null,null,null,null,null,null,null,null,null,null,null,null,null,"4.",null,{"$f":"'ZR Gruppeneinteilung'!F6","v":"TSV Barrien"},null,null,null,null,null,null,null,null,null,null,null,null,null,null,null,null,null,null,null,null,2]
[null,null,null,null,null,null,null,null,null,null,null,null,null,"5.",null,{"$f":"'ZR Gruppeneinteilung'!F7","v":"SF Oesede"},null,null,null,null,null,null,null,null,null,null,null,null,null,null,null,null,null,null,null,null,2]
[]
[null,"II. Spielplan"]
[]
[null,"Nr.",null,"Platz",null,null,null,null,null,"Beginn",null,null,null,null,"Spielpaarungen",null,null,null,null,null,null,null,null,null,null,null,null,null,null,null,null,null,null,null,null,null,null,null,null,null,null,null,null,null,null,null,null,null,"Ergebisse",null,null,null,null,"PL",null,null,null,"Punkte"]
[null,1,null,1,null,null,null,null,null,{"$f":"$H$5","v":"10:00:00"},null,null,null,null,{"$f":"P11","v":"JSG Riede/Emtinghausen 1"},null,null,null,null,null,null,null,null,null,null,null,null,null,null,null,"-",{"$f":"P12","v":"Frisia Loga"},null,null,null,null,null,null,null,null,null,null,null,null,null,null,null,null,1,null,":",0,null,2,null,null,null,{"$f":"IF(ISBLANK(AW20),\"0\",IF(AW20>AZ20,3,IF(AW20=AZ20,1,0)))","v":3},":",{"$f":"IF(ISBLANK(AZ20),\"0\",IF(AZ20>AW20,3,IF(AZ20=AW20,1,0)))","v":0},null,null,null,null,{"$f":"$P$11","v":"JSG Riede/Emtinghausen 1"},{"$f":"COUNT($BF$20,$BH$22,$BF$25,$BH$28)","v":4},{"$f":"SUM($BF$20+$BH$22+$BF$25+$BH$28)","v":8},{"$f":"SUM($AW$20+$AZ$22+$AW$25+$AZ$28)","v":2},":",{"$f":"SUM($AZ$20+$AW$22+$AZ$25+$AW$28)","v":0},{"$f":"SUM(BP20-BR20)","v":2}]
[null,2,null,1,null,null,null,null,null,{"$f":"J20+$U$5*$X$5+$AL$5","v":"10:14:00"},null,null,null,null,{"$f":"P13","v":"VfL Germania Leer"},null,null,null,null,null,null,null,null,null,null,null,null,null,null,null,"-",{"$f":"P14","v":"TSV Barrien"},null,null,null,null,null,null,null,null,null,null,null,null,null,null,null,null,0,null,":",0,null,2,null,null,null,{"$f":"IF(ISBLANK(AW21),\"0\",IF(AW21>AZ21,3,IF(AW21=AZ21,1,0)))","v":1},":",{"$f":"IF(ISBLANK(AZ21),\"0\",IF(AZ21>AW21,3,IF(AZ21=AW21,1,0)))","v":1},null,null,null,null,{"$f":"$P$15","v":"SF Oesede"},{"$f":"COUNT($BF$22,$BH$24,$BH$27,$BF$29)","v":4},{"$f":"SUM($BF$22+$BH$24+$BH$27+$BF$29)","v":6},{"$f":"SUM($AW$22+$AZ$24+$AZ$27+$AW$29)","v":7},":",{"$f":"SUM($AZ$22+$AW$24+$AW$27+$AZ$29)","v":0},{"$f":"SUM(BP21-BR21)","v":7}]
[null,3,null,1,null,null,null,null,null,{"$f":"J21+$U$5*$X$5+$AL$5","v":"10:28:00"},null,null,null,null,{"$f":"P15","v":"SF Oesede"},null,null,null,null,null,null,null,null,null,null,null,null,null,null,null,"-",{"$f":"P11","v":"JSG Riede/Emtinghausen 1"},null,null,null,null,null,null,null,null,null,null,null,null,null,null,null,null,0,null,":",0,null,2,null,null,null,1,":",1,null,null,null,null,{"$f":"$P$13","v":"VfL Germania Leer"},{"$f":"COUNT($BF$21,$BH$23,$BH$25,$BF$27)","v":4},{"$f":"SUM($BF$21+$BH$23+$BH$25+$BF$27)","v":5},{"$f":"SUM($AW$21+$AZ$23+$AZ$25+$AW$27)","v":4},":",{"$f":"SUM($AZ$21+$AW$23+$AW$25+$AZ$27)","v":2},{"$f":"SUM(BP22-BR22)","v":2}]
[null,4,null,1,null,null,null,null,null,"10:42:00",null,null,null,null,{"$f":"P12","v":"Frisia Loga"},null,null,null,null,null,null,null,null,null,null,null,null,null,null,null,"-",{"$f":"P13","v":"VfL Germania Leer"},null,null,null,null,null,null,null,null,null,null,null,null,null,null,null,null,1,null,":",4,null,2,null,null,null,0,":",3,null,null,null,null,{"$f":"$P$14","v":"TSV Barrien"},{"$f":"COUNT($BH$21,$BF$24,$BH$26,$BF$28)","v":4},{"$f":"SUM($BH$21+$BF$24+$BH$26+$BF$28)","v":4},{"$f":"SUM($AZ$21+$AW$24+$AZ$26+$AW$28)","v":2},":",{"$f":"SUM($AW$21+$AZ$24+$AW$26+$AZ$28)","v":2},{"$f":"SUM(BP23-BR23)","v":0}]
[null,5,null,1,null,null,null,null,null,"10:56:00",null,null,null,null,{"$f":"P14","v":"TSV Barrien"},null,null,null,null,null,null,null,null,null,null,null,null,null,null,null,"-",{"$f":"P15","v":"SF Oesede"},null,null,null,null,null,null,null,null,null,null,null,null,null,null,null,null,0,null,":",0,null,2,null,null,null,1,":",1,null,null,null,null,{"$f":"$P$12","v":"Frisia Loga"},{"$f":"COUNT($BH$20,$BF$23,$BF$26,$BH$29)","v":4},{"$f":"SUM($BH$20+$BF$23+$BF$26+$BH$29)","v":1},{"$f":"SUM($AZ$20+$AW$23+$AW$26+$AZ$29)","v":3},":",{"$f":"SUM($AW$20+$AZ$23+$AZ$26+$AW$29)","v":14},{"$f":"SUM(BP24-BR24)","v":-11}]
[null,6,null,1,null,null,null,null,null,"11:10:00",null,null,null,null,{"$f":"P11","v":"JSG Riede/Emtinghausen 1"},null,null,null,null,null,null,null,null,null,null,null,null,null,null,null,"-",{"$f":"P13","v":"VfL Germania Leer"},null,null,null,null,null,null,null,null,null,null,null,null,null,null,null,null,1,null,":",0,null,2,null,null,null,3,":",0]
[null,7,null,1,null,null,null,null,null,"11:24:00",null,null,null,null,{"$f":"P12","v":"Frisia Loga"},null,null,null,null,null,null,null,null,null,null,null,null,null,null,null,"-",{"$f":"P14","v":"TSV Barrien"},null,null,null,null,null,null,null,null,null,null,null,null,null,null,null,null,2,null,":",2,null,2,null,null,null,1,":",1]
[null,8,null,1,null,null,null,null,null,"12:30:00",null,null,null,null,{"$f":"P13","v":"VfL Germania Leer"},null,null,null,null,null,null,null,null,null,null,null,null,null,null,null,"-",{"$f":"P15","v":"SF Oesede"},null,null,null,null,null,null,null,null,null,null,null,null,null,null,null,null,0,null,":",0,null,2,null,null,null,1,":",1]
[null,9,null,1,null,null,null,null,null,"12:44:00",null,null,null,null,{"$f":"P14","v":"TSV Barrien"},null,null,null,null,null,null,null,null,null,null,null,null,null,null,null,"-",{"$f":"P11","v":"JSG Riede/Emtinghausen 1"},null,null,null,null,null,null,null,null,null,null,null,null,null,null,null,null,0,null,":",0,null,2,null,null,null,1,":",1]
[null,10,null,1,null,null,null,null,null,"12:58:00",null,null,null,null,{"$f":"P15","v":"SF Oesede"},null,null,null,null,null,null,null,null,null,null,null,null,null,null,null,"-",{"$f":"P12","v":"Frisia Loga"},null,null,null,null,null,null,null,null,null,null,null,null,null,null,null,null,7,null,":",0,null,2,null,null,null,3,":",0]
[]
[null,"III. Abschlusstabelle"]
[]
[]
[null,null,null,null,null,null,null,null,"Mannschaften",null,null,null,null,null,null,null,null,null,null,null,null,null,null,null,null,null,null,null,null,null,null,null,null,"Sp.",null,null,"Pkt.",null,null,"Tore",null,null,null,null,"Diff."]
[null,null,null,null,null,null,null,null,"1.",null,{"$f":"BM20","v":"JSG Riede/Emtinghausen 1"},null,null,null,null,null,null,null,null,null,null,null,null,null,null,null,null,null,null,null,null,null,null,{"$f":"BN20","v":4},null,null,{"$f":"BO20","v":8},null,null,{"$f":"BP20","v":2},null,":",{"$f":"BR20","v":0},null,{"$f":"BS20","v":2}]
[null,null,null,null,null,null,null,null,"2.",null,{"$f":"BM21","v":"SF Oesede"},null,null,null,null,null,null,null,null,null,null,null,null,null,null,null,null,null,null,null,null,null,null,{"$f":"BN21","v":4},null,null,{"$f":"BO21","v":6},null,null,{"$f":"BP21","v":7},null,":",{"$f":"BR21","v":0},null,{"$f":"BS21","v":7}]
[null,null,null,null,null,null,null,null,"3.",null,"VfL Germania Leer",null,null,null,null,null,null,null,null,null,null,null,null,null,null,null,null,null,null,null,null,null,null,4,null,null,5,null,null,4,null,":",2,null,2]
[null,null,null,null,null,null,null,null,"4.",null,"TSV Barrien",null,null,null,null,null,null,null,null,null,null,null,null,null,null,null,null,null,null,null,null,null,null,4,null,null,4,null,null,2,null,":",2,null,0]
[null,null,null,null,null,null,null,null,"5.",null,"Frisia Loga",null,null,null,null,null,null,null,null,null,null,null,null,null,null,null,null,null,null,null,null,null,null,4,null,null,1,null,null,3,null,":",14,null,-11]
[]
["Achtung! Mittagspause zwischen Spiel 7 und 8 !"]

{"sheet":"Endrunde","index":9,"n_rows":33,"n_cols":10,"rows_kept":33,"cut":false,"hidden":false,"merged":[[7,1,8,1],[7,2,8,2],[7,3,8,3],[2,4,2,6],[3,1,4,1],[3,2,4,2],[3,3,4,3],[6,4,6,6],[18,4,18,6],[19,1,20,1],[19,2,20,2],[19,3,20,3],[10,4,10,6],[11,1,12,1],[11,2,12,2],[11,3,12,3],[14,4,14,6],[15,1,16,1],[15,2,16,2],[15,3,16,3]]}
[]
[]
[null,"Nr.","Platz ","Beginn","Spiel um Platz 9 und 10",null,null,null,"Ergebnis"]
[null,15,3,"13:30:00",{"$f":"'ZR Gruppe A'!$K$39","v":"VfL Viktoria Flachsmeer"},null,{"$f":"'ZR Gruppe B'!$K$39","v":"Frisia Loga"},0,":",2]
[null,null,null,null,"5. ZR Gruppe A",":","5. ZR Gruppe B"]
[]
[null,"Nr.","Platz ","Beginn","Spiel um Platz 7 und 8",null,null,null,"Ergebnis"]
[null,15,2,"13:30:00",{"$f":"'ZR Gruppe A'!$K$38","v":"VfL \"Fortuna\" Veenhusen 1"},null,{"$f":"'ZR Gruppe B'!$K$38","v":"TSV Barrien"},0,":",1]
[null,null,null,null,"4.  ZR Gruppe A",null,"4.  ZR Gruppe B"]
[]
[null,"Nr.","Platz","Beginn","Spiel um Platz 5 und 6",null,null,null,"Ergebnis"]
[null,16,1,"13:30:00",{"$f":"'ZR Gruppe A'!$K$37","v":"TV Jahn Delmenhorst"},null,{"$f":"'ZR Gruppe B'!$K$37","v":"VfL Germania Leer"},3,":",2]
[null,null,null,null,"3.  ZR Gruppe A",null,"3.  ZR Gruppe B"]
[]
[null,"Nr.","Platz ","Beginn","Spiel um Platz 3 und 4",null,null,null,"Ergebnis"]
[null,17,1,"14:00:00",{"$f":"'ZR Gruppe A'!$K$36","v":"BW Papenburg"},null,{"$f":"'ZR Gruppe B'!$K$36","v":"SF Oesede"},1,":",0]
[null,null,null,null,"2. ZR Gruppe A",null,"2. ZR Gruppe B"]
[]
[null,"Nr.","Platz ","Beginn","Endspiel",null,null,null,"Ergebnis"]
[null,18,1,"14:30:00",{"$f":"'ZR Gruppe A'!$K$35","v":"Weiße Elf Nordhorn"},null,{"$f":"'ZR Gruppe B'!$K$35","v":"JSG Riede/Emtinghausen 1"},0,":",2]
[null,null,null,null,"1. ZR Gruppe 1",null,"1. ZR Gruppe B"]
[]
[null,null,null,null,"Platzierungen Endrunde"]
[null,null,null,1,{"$f":"IF(ISBLANK($J$20),\" \",IF($H$20>$J$20,$E$20,IF($J$20>$H$20,$G$20)))","v":"JSG Riede/Emtinghausen 1"}]
[null,null,null,2,{"$f":"IF(ISBLANK($J$20),\" \",IF($H$20<$J$20,$E$20,IF($J$20<$H$20,$G$20)))","v":"Weiße Elf Nordhorn"}]
[null,null,null,3,{"$f":"IF(ISBLANK($J$16),\" \",IF($H$16>$J$16,$E$16,IF($J$16>$H$16,$G$16)))","v":"BW Papenburg"}]
[null,null,null,4,{"$f":"IF(ISBLANK($J$16),\" \",IF($H$16<$J$16,$E$16,IF($J$16<$H$16,$G$16)))","v":"SF Oesede"}]
[null,null,null,5,{"$f":"IF(ISBLANK($J$12),\" \",IF($H$12>$J$12,$E$12,IF($J$12>$H$12,$G$12)))","v":"TV Jahn Delmenhorst"}]
[null,null,null,6,{"$f":"IF(ISBLANK($J$12),\" \",IF($H$12<$J$12,$E$12,IF($J$12<$H$12,$G$12)))","v":"VfL Germania Leer"}]
[null,null,null,7,{"$f":"IF(ISBLANK($J$8),\" \",IF($H$8>$J$8,$E$8,IF($J$8>$H$8,$G$8)))","v":"TSV Barrien"}]
[null,null,null,8,{"$f":"IF(ISBLANK($J$8),\" \",IF($H$8<$J$8,$E$8,IF($J$8<$H$8,$G$8)))","v":"VfL \"Fortuna\" Veenhusen 1"}]
[null,null,null,9,{"$f":"IF(ISBLANK($J$4),\" \",IF($H$4>$J$4,$E$4,IF($J$4>$H$4,$G$4)))","v":"Frisia Loga"}]
[null,null,null,10,{"$f":"IF(ISBLANK($J$4),\" \",IF($H$4<$J$4,$E$4,IF($J$4<$H$4,$G$4)))","v":"VfL Viktoria Flachsmeer"}]

{"sheet":"GR Platzierungsspiele VR","index":10,"n_rows":15,"n_cols":7,"rows_kept":15,"cut":false,"hidden":false,"merged":[[1,0,1,1],[1,4,1,5],[9,0,9,1],[9,4,9,5]]}
[]
["Spiele um Platz 11 - 15",null,"Platz",null,"Spiele um Platz 16 - 20",null,"Platz"]
["1.",{"$f":"'VR Gruppe A'!$K$42","v":"JSG Kloster Oesede/Harderberg"},3,null,"1.",{"$f":"'VR Gruppe A'!$K$43","v":"TuS Eversten E5"},4]
["2.",{"$f":"'VR Gruppe B'!$K$42","v":"FSV Westerstede"},3,null,"2.",{"$f":"'VR Gruppe B'!$K$43","v":"TuS  Hasbergen"},4]
["3.",{"$f":"'VR Gruppe C'!$K$42","v":"TuS Strudden 1"},3,null,"3.",{"$f":"'VR Gruppe C'!$K$43","v":"JSG Riede/Emtinghausen 2"},4]
["4.",{"$f":"'VR Gruppe D'!$K$42","v":"SV Großefehn"},3,null,"4.",{"$f":"'VR Gruppe D'!$K$43","v":"TuS Strudden 2"},4]
["5.",{"$f":"'VR Gruppe E'!$K$42","v":"TV Apen"},3,null,"5.",{"$f":"'VR Gruppe E'!$K$43","v":"SV Spetzerfehn"},4]
[]
[]
["Spiele um Platz 21 - 25",null,"Platz",null,"Spiele um Platz 26 - 30",null,"Platz"]
["1.",{"$f":"'VR Gruppe A'!$K$44","v":"Borussia Salchendorf"},5,null,"1.",{"$f":"'VR Gruppe A'!$K$45","v":"VfL \"Fortuna\" Veenhusen 3"},6]
["2.",{"$f":"'VR Gruppe B'!$K$44","v":"SV Warsingsfehn 3"},5,null,"2.",{"$f":"'VR Gruppe B'!$K$45","v":"\"Fortuna\" Veenhusen E-Mädchen"},6]
["3.",{"$f":"'VR Gruppe C'!$K$44","v":"TuS Holthusen"},5,null,"3.",{"$f":"'VR Gruppe C'!$K$45","v":"BW Galgenmoor"},6]
["4.",{"$f":"'VR Gruppe D'!$K$44","v":"TuS Weener"},5,null,"4.",{"$f":"'VR Gruppe D'!$K$45","v":"VfL \"Fortuna\" Veenhusen 2"},6]
["5.",{"$f":"'VR Gruppe E'!$K$44","v":"SV Wallinghausen"},5,null,"5.",{"$f":"'VR Gruppe E'!$K$45","v":"SV Concordia Neermoor"},6]

{"sheet":"11 - 15","index":11,"n_rows":41,"n_cols":71,"rows_kept":41,"cut":false,"hidden":false,"merged":[[1,0,1,55],[2,0,2,55],[14,13,14,14],[14,15,14,35],[14,36,14,37],[12,36,12,37],[13,13,13,14],[13,15,13,35],[13,36,13,37],[11,15,11,35],[11,36,11,37],[4,7,4,11],[4,20,4,21],[4,23,4,27],[4,37,4,41],[18,48,18,52],[18,53,18,54],[9,13,9,35],[9,36,9,37],[10,13,10,14],[10,15,10,35],[10,36,10,37],[11,13,11,14],[19,1,19,2],[19,3,19,5],[19,6,19,8],[19,9,19,13],[19,14,19,29],[19,31,19,47],[19,48,19,49],[19,51,19,52],[19,53,19,54],[18,1,18,2],[18,3,18,5],[18,6,18,8],[18,9,18,13],[18,14,18,47],[12,13,12,14],[12,15,12,35],[20,1,20,2],[20,3,20,5],[20,6,20,8],[20,9,20,13],[20,14,20,29],[20,31,20,47],[20,48,20,49],[20,51,20,52],[20,53,20,54],[21,48,21,49],[21,51,21,52],[21,53,21,54],[22,1,22,2],[22,3,22,5],[22,6,22,8],[22,9,22,13],[22,14,22,29],[22,31,22,47],[22,48,22,49],[21,1,21,2],[21,3,21,5],[21,6,21,8],[21,9,21,13],[21,14,21,29],[21,31,21,47],[22,51,22,52],[22,53,22,54],[23,1,23,2],[23,3,23,5],[23,6,23,8],[23,9,23,13],[23,14,23,29],[23,31,23,47],[23,48,23,49],[23,51,23,52],[23,53,23,54],[24,1,24,2],[24,3,24,5],[24,6,24,8],[24,9,24,13],[24,14,24,29],[24,31,24,47],[24,48,24,49],[24,51,24,52],[24,53,24,54],[25,48,25,49],[25,51,25,52],[25,53,25,54],[26,1,26,2],[26,3,26,5],[26,6,26,8],[26,9,26,13],[26,14,26,29],[26,31,26,47],[26,48,26,49],[25,1,25,2],[25,3,25,5],[25,6,25,8],[25,9,25,13],[25,14,25,29],[25,31,25,47],[26,51,26,52],[26,53,26,54],[27,1,27,2],[27,3,27,5],[27,6,27,8],[27,9,27,13],[27,14,27,29],[27,31,27,47],[27,48,27,49],[27,51,27,52],[27,53,27,54],[28,1,28,2],[28,3,28,5],[28,6,28,8],[28,9,28,13],[28,14,28,29],[28,31,28,47],[28,48,28,49],[28,51,28,52],[28,53,28,54],[35,8,35,9],[35,10,35,32],[33,8,33,32],[33,33,33,35],[33,36,33,38],[33,39,33,43],[33,44,33,46],[34,8,34,9],[34,10,34,32],[34,33,34,35],[34,36,34,38],[34,39,34,40],[34,42,34,43],[34,44,34,46],[35,33,35,35],[35,36,35,38],[35,39,35,40],[35,42,35,43],[35,44,35,46],[38,44,38,46],[38,8,38,9],[38,10,38,32],[38,33,38,35],[38,36,38,38],[38,39,38,40],[38,42,38,43],[36,44,36,46],[37,8,37,9],[37,10,37,32],[37,33,37,35],[37,36,37,38],[37,39,37,40],[37,42,37,43],[37,44,37,46],[36,8,36,9],[36,10,36,32],[36,33,36,35],[36,36,36,38],[36,39,36,40],[36,42,36,43]]}
[]
["Platzierungsspiele"]
["Platz 11 - 15"]
[]
[null,null,null,null,null,null,"Beginn:","10:00:00",null,null,null,null,"Uhr",null,null,null,null,null,null,"Spielzeit",1,"1x","x","00:12:00",null,null,null,null,"min",null,null,null,null,null,null,null,"Pause:","00:02:00",null,null,null,null,"min"]
[]
[]
[null,"I. Teilnehmende Mannschaften"]
[]
[null,null,null,null,null,null,null,null,null,null,null,null,null,"Gruppeneinteilung",null,null,null,null,null,null,null,null,null,null,null,null,null,null,null,null,null,null,null,null,null,null,"PL"]
[null,null,null,null,null,null,null,null,null,null,null,null,null,"1.",null,{"$f":"'GR Platzierungsspiele VR'!B3","v":"JSG Kloster Oesede/Harderberg"},null,null,null,null,null,null,null,null,null,null,null,null,null,null,null,null,null,null,null,null,3]
[null,null,null,null,null,null,null,null,null,null,null,null,null,"2.",null,{"$f":"'GR Platzierungsspiele VR'!B4","v":"FSV Westerstede"},null,null,null,null,null,null,null,null,null,null,null,null,null,null,null,null,null,null,null,null,3]
[null,null,null,null,null,null,null,null,null,null,null,null,null,"3.",null,{"$f":"'GR Platzierungsspiele VR'!B5","v":"TuS Strudden 1"},null,null,null,null,null,null,null,null,null,null,null,null,null,null,null,null,null,null,null,null,3]
[null,null,null,null,null,null,null,null,null,null,null,null,null,"4.",null,{"$f":"'GR Platzierungsspiele VR'!B6","v":"SV Großefehn"},null,null,null,null,null,null,null,null,null,null,null,null,null,null,null,null,null,null,null,null,3]
[null,null,null,null,null,null,null,null,null,null,null,null,null,"5.",null,{"$f":"'GR Platzierungsspiele VR'!B7","v":"TV Apen"},null,null,null,null,null,null,null,null,null,null,null,null,null,null,null,null,null,null,null,null,3]
[]
[null,"II. Spielplan"]
[]
[null,"Nr.",null,"Platz",null,null,null,null,null,"Beginn",null,null,null,null,"Spielpaarungen",null,null,null,null,null,null,null,null,null,null,null,null,null,null,null,null,null,null,null,null,null,null,null,null,null,null,null,null,null,null,null,null,null,"Ergebisse",null,null,null,null,"PL",null,null,null,"Punkte"]
[null,1,null,{"$f":"'GR Platzierungsspiele VR'!C$3","v":3},null,null,null,null,null,{"$f":"$H$5","v":"10:00:00"},null,null,null,null,{"$f":"P11","v":"JSG Kloster Oesede/Harderberg"},null,null,null,null,null,null,null,null,null,null,null,null,null,null,null,"-",{"$f":"P12","v":"FSV Westerstede"},null,null,null,null,null,null,null,null,null,null,null,null,null,null,null,null,0,null,":",1,null,3,null,null,null,{"$f":"IF(ISBLANK(AW20),\"0\",IF(AW20>AZ20,3,IF(AW20=AZ20,1,0)))","v":0},":",{"$f":"IF(ISBLANK(AZ20),\"0\",IF(AZ20>AW20,3,IF(AZ20=AW20,1,0)))","v":3},null,null,null,null,{"$f":"$P$12","v":"FSV Westerstede"},{"$f":"COUNT($BH$20,$BF$23,$BF$26,$BH$29)","v":4},{"$f":"SUM($BH$20+$BF$23+$BF$26+$BH$29)","v":10},{"$f":"SUM($AZ$20+$AW$23+$AW$26+$AZ$29)","v":4},":",{"$f":"SUM($AW$20+$AZ$23+$AZ$26+$AW$29)","v":1},{"$f":"SUM(BP20-BR20)","v":3}]
[null,2,null,{"$f":"'GR Platzierungsspiele VR'!C$3","v":3},null,null,null,null,null,{"$f":"J20+$U$5*$X$5+$AL$5","v":"10:14:00"},null,null,null,null,{"$f":"P13","v":"TuS Strudden 1"},null,null,null,null,null,null,null,null,null,null,null,null,null,null,null,"-",{"$f":"P14","v":"SV Großefehn"},null,null,null,null,null,null,null,null,null,null,null,null,null,null,null,null,0,null,":",1,null,3,null,null,null,{"$f":"IF(ISBLANK(AW21),\"0\",IF(AW21>AZ21,3,IF(AW21=AZ21,1,0)))","v":0},":",{"$f":"IF(ISBLANK(AZ21),\"0\",IF(AZ21>AW21,3,IF(AZ21=AW21,1,0)))","v":3},null,null,null,null,{"$f":"$P$13","v":"TuS Strudden 1"},{"$f":"COUNT($BF$21,$BH$23,$BH$25,$BF$27)","v":4},{"$f":"SUM($BF$21+$BH$23+$BH$25+$BF$27)","v":5},{"$f":"SUM($AW$21+$AZ$23+$AZ$25+$AW$27)","v":4},":",{"$f":"SUM($AZ$21+$AW$23+$AW$25+$AZ$27)","v":1},{"$f":"SUM(BP21-BR21)","v":3}]
[null,3,null,{"$f":"'GR Platzierungsspiele VR'!C$3","v":3},null,null,null,null,null,{"$f":"J21+$U$5*$X$5+$AL$5","v":"10:28:00"},null,null,null,null,{"$f":"P15","v":"TV Apen"},null,null,null,null,null,null,null,null,null,null,null,null,null,null,null,"-",{"$f":"P11","v":"JSG Kloster Oesede/Harderberg"},null,null,null,null,null,null,null,null,null,null,null,null,null,null,null,null,0,null,":",0,null,3,null,null,null,1,":",1,null,null,null,null,{"$f":"$P$15","v":"TV Apen"},{"$f":"COUNT($BF$22,$BH$24,$BH$27,$BF$29)","v":4},{"$f":"SUM($BF$22+$BH$24+$BH$27+$BF$29)","v":5},{"$f":"SUM($AW$22+$AZ$24+$AZ$27+$AW$29)","v":2},":",{"$f":"SUM($AZ$22+$AW$24+$AW$27+$AZ$29)","v":2},{"$f":"SUM(BP22-BR22)","v":0}]
[null,4,null,{"$f":"'GR Platzierungsspiele VR'!C$3","v":3},null,null,null,null,null,"10:42:00",null,null,null,null,{"$f":"P12","v":"FSV Westerstede"},null,null,null,null,null,null,null,null,null,null,null,null,null,null,null,"-",{"$f":"P13","v":"TuS Strudden 1"},null,null,null,null,null,null,null,null,null,null,null,null,null,null,null,null,0,null,":",0,null,3,null,null,null,1,":",1,null,null,null,null,{"$f":"$P$11","v":"JSG Kloster Oesede/Harderberg"},{"$f":"COUNT($BF$20,$BH$22,$BF$25,$BH$28)","v":4},{"$f":"SUM($BF$20+$BH$22+$BF$25+$BH$28)","v":4},{"$f":"SUM($AW$20+$AZ$22+$AW$25+$AZ$28)","v":2},":",{"$f":"SUM($AZ$20+$AW$22+$AZ$25+$AW$28)","v":6},{"$f":"SUM(BP23-BR23)","v":-4}]
[null,5,null,{"$f":"'GR Platzierungsspiele VR'!C$3","v":3},null,null,null,null,null,"10:56:00",null,null,null,null,{"$f":"P14","v":"SV Großefehn"},null,null,null,null,null,null,null,null,null,null,null,null,null,null,null,"-",{"$f":"P15","v":"TV Apen"},null,null,null,null,null,null,null,null,null,null,null,null,null,null,null,null,0,null,":",1,null,3,null,null,null,0,":",3,null,null,null,null,{"$f":"$P$14","v":"SV Großefehn"},{"$f":"COUNT($BH$21,$BF$24,$BH$26,$BF$28)","v":4},{"$f":"SUM($BH$21+$BF$24+$BH$26+$BF$28)","v":3},{"$f":"SUM($AZ$21+$AW$24+$AZ$26+$AW$28)","v":2},":",{"$f":"SUM($AW$21+$AZ$24+$AW$26+$AZ$28)","v":4},{"$f":"SUM(BP24-BR24)","v":-2}]
[null,6,null,{"$f":"'GR Platzierungsspiele VR'!C$3","v":3},null,null,null,null,null,"11:10:00",null,null,null,null,{"$f":"P11","v":"JSG Kloster Oesede/Harderberg"},null,null,null,null,null,null,null,null,null,null,null,null,null,null,null,"-",{"$f":"P13","v":"TuS Strudden 1"},null,null,null,null,null,null,null,null,null,null,null,null,null,null,null,null,0,null,":",4,null,3,null,null,null,0,":",3]
[null,7,null,{"$f":"'GR Platzierungsspiele VR'!C$3","v":3},null,null,null,null,null,"11:24:00",null,null,null,null,{"$f":"P12","v":"FSV Westerstede"},null,null,null,null,null,null,null,null,null,null,null,null,null,null,null,"-",{"$f":"P14","v":"SV Großefehn"},null,null,null,null,null,null,null,null,null,null,null,null,null,null,null,null,1,null,":",0,null,3,null,null,null,3,":",0]
[null,8,null,{"$f":"'GR Platzierungsspiele VR'!C$3","v":3},null,null,null,null,null,"12:30:00",null,null,null,null,{"$f":"P13","v":"TuS Strudden 1"},null,null,null,null,null,null,null,null,null,null,null,null,null,null,null,"-",{"$f":"P15","v":"TV Apen"},null,null,null,null,null,null,null,null,null,null,null,null,null,null,null,null,0,null,":",0,null,3,null,null,null,1,":",1]
[null,9,null,{"$f":"'GR Platzierungsspiele VR'!C$3","v":3},null,null,null,null,null,"12:44:00",null,null,null,null,{"$f":"P14","v":"SV Großefehn"},null,null,null,null,null,null,null,null,null,null,null,null,null,null,null,"-",{"$f":"P11","v":"JSG Kloster Oesede/Harderberg"},null,null,null,null,null,null,null,null,null,null,null,null,null,null,null,null,1,null,":",2,null,3,null,null,null,0,":",3]
[null,10,null,{"$f":"'GR Platzierungsspiele VR'!C$3","v":3},null,null,null,null,null,"12:58:00",null,null,null,null,{"$f":"P15","v":"TV Apen"},null,null,null,null,null,null,null,null,null,null,null,null,null,null,null,"-",{"$f":"P12","v":"FSV Westerstede"},null,null,null,null,null,null,null,null,null,null,null,null,null,null,null,null,1,null,":",2,null,3,null,null,null,0,":",3]
[]
[null,"III. Abschlusstabelle"]
[]
[]
[null,null,null,null,null,null,null,null,"Mannschaften",null,null,null,null,null,null,null,null,null,null,null,null,null,null,null,null,null,null,null,null,null,null,null,null,"Sp.",null,null,"Pkt.",null,null,"Tore",null,null,null,null,"Diff."]
[null,null,null,null,null,null,null,null,"1.",null,{"$f":"BM20","v":"FSV Westerstede"},null,null,null,null,null,null,null,null,null,null,null,null,null,null,null,null,null,null,null,null,null,null,{"$f":"BN20","v":4},null,null,{"$f":"BO20","v":10},null,null,{"$f":"BP20","v":4},null,":",{"$f":"BR20","v":1},null,{"$f":"BS20","v":3}]
[null,null,null,null,null,null,null,null,"2.",null,{"$f":"BM21","v":"TuS Strudden 1"},null,null,null,null,null,null,null,null,null,null,null,null,null,null,null,null,null,null,null,null,null,null,{"$f":"BN21","v":4},null,null,{"$f":"BO21","v":5},null,null,{"$f":"BP21","v":4},null,":",{"$f":"BR21","v":1},null,{"$f":"BS21","v":3}]
[null,null,null,null,null,null,null,null,"3.",null,{"$f":"BM22","v":"TV Apen"},null,null,null,null,null,null,null,null,null,null,null,null,null,null,null,null,null,null,null,null,null,null,{"$f":"BN22","v":4},null,null,{"$f":"BO22","v":5},null,null,{"$f":"BP22","v":2},null,":",{"$f":"BR22","v":2},null,{"$f":"BS22","v":0}]
[null,null,null,null,null,null,null,null,"4.",null,{"$f":"BM23","v":"JSG Kloster Oesede/Harderberg"},null,null,null,null,null,null,null,null,null,null,null,null,null,null,null,null,null,null,null,null,null,null,{"$f":"BN23","v":4},null,null,{"$f":"BO23","v":4},null,null,{"$f":"BP23","v":2},null,":",{"$f":"BR23","v":6},null,{"$f":"BS23","v":-4}]
[null,null,null,null,null,null,null,null,"5.",null,{"$f":"BM24","v":"SV Großefehn"},null,null,null,null,null,null,null,null,null,null,null,null,null,null,null,null,null,null,null,null,null,null,{"$f":"BN24","v":4},null,null,{"$f":"BO24","v":3},null,null,{"$f":"BP24","v":2},null,":",{"$f":"BR24","v":4},null,{"$f":"BS24","v":-2}]
[]
["Achtung! Mittagspause zwischen Spiel 7 und 8 !"]

{"sheet":"16 - 20","index":12,"n_rows":41,"n_cols":71,"rows_kept":41,"cut":false,"hidden":false,"merged":[[0,0,1,55],[9,13,9,35],[9,36,9,37],[10,13,10,14],[10,15,10,35],[10,36,10,37],[11,13,11,14],[11,15,11,35],[11,36,11,37],[4,7,4,11],[4,20,4,21],[4,23,4,27],[4,37,4,41],[2,0,2,55],[14,13,14,14],[14,15,14,35],[14,36,14,37],[18,1,18,2],[18,3,18,5],[18,6,18,8],[18,9,18,13],[18,14,18,47],[12,13,12,14],[12,15,12,35],[12,36,12,37],[13,13,13,14],[13,15,13,35],[13,36,13,37],[18,48,18,52],[18,53,18,54],[19,1,19,2],[19,3,19,5],[19,6,19,8],[19,9,19,13],[19,14,19,29],[19,31,19,47],[19,48,19,49],[19,51,19,52],[19,53,19,54],[20,1,20,2],[20,3,20,5],[20,6,20,8],[20,9,20,13],[20,14,20,29],[20,31,20,47],[20,48,20,49],[20,51,20,52],[20,53,20,54],[21,48,21,49],[21,51,21,52],[21,53,21,54],[22,1,22,2],[22,3,22,5],[22,6,22,8],[22,9,22,13],[22,14,22,29],[22,31,22,47],[22,48,22,49],[21,1,21,2],[21,3,21,5],[21,6,21,8],[21,9,21,13],[21,14,21,29],[21,31,21,47],[22,51,22,52],[22,53,22,54],[23,1,23,2],[23,3,23,5],[23,6,23,8],[23,9,23,13],[23,14,23,29],[23,31,23,47],[23,48,23,49],[23,51,23,52],[23,53,23,54],[24,1,24,2],[24,3,24,5],[24,6,24,8],[24,9,24,13],[24,14,24,29],[24,31,24,47],[24,48,24,49],[24,51,24,52],[24,53,24,54],[25,48,25,49],[25,51,25,52],[25,53,25,54],[26,1,26,2],[26,3,26,5],[26,6,26,8],[26,9,26,13],[26,14,26,29],[26,31,26,47],[26,48,26,49],[25,1,25,2],[25,3,25,5],[25,6,25,8],[25,9,25,13],[25,14,25,29],[25,31,25,47],[26,51,26,52],[26,53,26,54],[27,1,27,2],[27,3,27,5],[27,6,27,8],[27,9,27,13],[27,14,27,29],[27,31,27,47],[27,48,27,49],[27,51,27,52],[27,53,27,54],[28,1,28,2],[28,3,28,5],[28,6,28,8],[28,9,28,13],[28,14,28,29],[28,31,28,47],[28,48,28,49],[28,51,28,52],[28,53,28,54],[35,8,35,9],[35,10,35,32],[33,8,33,32],[33,33,33,35],[33,36,33,38],[33,39,33,43],[33,44,33,46],[34,8,34,9],[34,10,34,32],[34,33,34,35],[34,36,34,38],[34,39,34,40],[34,42,34,43],[34,44,34,46],[35,33,35,35],[35,36,35,38],[35,39,35,40],[35,42,35,43],[35,44,35,46],[38,44,38,46],[38,8,38,9],[38,10,38,32],[38,33,38,35],[38,36,38,38],[38,39,38,40],[38,42,38,43],[36,44,36,46],[37,8,37,9],[37,10,37,32],[37,33,37,35],[37,36,37,38],[37,39,37,40],[37,42,37,43],[37,44,37,46],[36,8,36,9],[36,10,36,32],[36,33,36,35],[36,36,36,38],[36,39,36,40],[36,42,36,43]]}
["Platzierungsspiele"]
[]
["Platz 16 - 20"]
[]
[null,null,null,null,null,null,"Beginn:","10:00:00",null,null,null,null,"Uhr",null,null,null,null,null,null,"Spielzeit",1,"1x","x","00:12:00",null,null,null,null,"min",null,null,null,null,null,null,null,"Pause:","00:02:00",null,null,null,null,"min"]
[]
[]
[null,"I. Teilnehmende Mannschaften"]
[]
[null,null,null,null,null,null,null,null,null,null,null,null,null,"Gruppeneinteilung",null,null,null,null,null,null,null,null,null,null,null,null,null,null,null,null,null,null,null,null,null,null,"PL"]
[null,null,null,null,null,null,null,null,null,null,null,null,null,"1.",null,{"$f":"'GR Platzierungsspiele VR'!F3","v":"TuS Eversten E5"},null,null,null,null,null,null,null,null,null,null,null,null,null,null,null,null,null,null,null,null,4]
[null,null,null,null,null,null,null,null,null,null,null,null,null,"2.",null,{"$f":"'GR Platzierungsspiele VR'!F4","v":"TuS  Hasbergen"},null,null,null,null,null,null,null,null,null,null,null,null,null,null,null,null,null,null,null,null,4]
[null,null,null,null,null,null,null,null,null,null,null,null,null,"3.",null,{"$f":"'GR Platzierungsspiele VR'!F5","v":"JSG Riede/Emtinghausen 2"},null,null,null,null,null,null,null,null,null,null,null,null,null,null,null,null,null,null,null,null,4]
[null,null,null,null,null,null,null,null,null,null,null,null,null,"4.",null,{"$f":"'GR Platzierungsspiele VR'!F6","v":"TuS Strudden 2"},null,null,null,null,null,null,null,null,null,null,null,null,null,null,null,null,null,null,null,null,4]
[null,null,null,null,null,null,null,null,null,null,null,null,null,"5.",null,{"$f":"'GR Platzierungsspiele VR'!F7","v":"SV Spetzerfehn"},null,null,null,null,null,null,null,null,null,null,null,null,null,null,null,null,null,null,null,null,4]
[]
[null,"II. Spielplan"]
[]
[null,"Nr.",null,"Platz",null,null,null,null,null,"Beginn",null,null,null,null,"Spielpaarungen",null,null,null,null,null,null,null,null,null,null,null,null,null,null,null,null,null,null,null,null,null,null,null,null,null,null,null,null,null,null,null,null,null,"Ergebisse",null,null,null,null,"PL",null,null,null,"Punkte"]
[null,1,null,{"$f":"'GR Platzierungsspiele VR'!G$3","v":4},null,null,null,null,null,{"$f":"$H$5","v":"10:00:00"},null,null,null,null,{"$f":"P11","v":"TuS Eversten E5"},null,null,null,null,null,null,null,null,null,null,null,null,null,null,null,"-",{"$f":"P12","v":"TuS  Hasbergen"},null,null,null,null,null,null,null,null,null,null,null,null,null,null,null,null,0,null,":",2,null,4,null,null,null,{"$f":"IF(ISBLANK(AW20),\"0\",IF(AW20>AZ20,3,IF(AW20=AZ20,1,0)))","v":0},":",{"$f":"IF(ISBLANK(AZ20),\"0\",IF(AZ20>AW20,3,IF(AZ20=AW20,1,0)))","v":3},null,null,null,null,{"$f":"$P$12","v":"TuS  Hasbergen"},{"$f":"COUNT($BH$20,$BF$23,$BF$26,$BH$29)","v":4},{"$f":"SUM($BH$20+$BF$23+$BF$26+$BH$29)","v":12},{"$f":"SUM($AZ$20+$AW$23+$AW$26+$AZ$29)","v":10},":",{"$f":"SUM($AW$20+$AZ$23+$AZ$26+$AW$29)","v":1},{"$f":"SUM(BP20-BR20)","v":9}]
[null,2,null,{"$f":"'GR Platzierungsspiele VR'!G$3","v":4},null,null,null,null,null,{"$f":"J20+$U$5*$X$5+$AL$5","v":"10:14:00"},null,null,null,null,{"$f":"P13","v":"JSG Riede/Emtinghausen 2"},null,null,null,null,null,null,null,null,null,null,null,null,null,null,null,"-",{"$f":"P14","v":"TuS Strudden 2"},null,null,null,null,null,null,null,null,null,null,null,null,null,null,null,null,1,null,":",1,null,4,null,null,null,{"$f":"IF(ISBLANK(AW21),\"0\",IF(AW21>AZ21,3,IF(AW21=AZ21,1,0)))","v":1},":",{"$f":"IF(ISBLANK(AZ21),\"0\",IF(AZ21>AW21,3,IF(AZ21=AW21,1,0)))","v":1},null,null,null,null,{"$f":"$P$14","v":"TuS Strudden 2"},{"$f":"COUNT($BH$21,$BF$24,$BH$26,$BF$28)","v":4},{"$f":"SUM($BH$21+$BF$24+$BH$26+$BF$28)","v":7},{"$f":"SUM($AZ$21+$AW$24+$AZ$26+$AW$28)","v":7},":",{"$f":"SUM($AW$21+$AZ$24+$AW$26+$AZ$28)","v":5},{"$f":"SUM(BP21-BR21)","v":2}]
[null,3,null,{"$f":"'GR Platzierungsspiele VR'!G$3","v":4},null,null,null,null,null,{"$f":"J21+$U$5*$X$5+$AL$5","v":"10:28:00"},null,null,null,null,{"$f":"P15","v":"SV Spetzerfehn"},null,null,null,null,null,null,null,null,null,null,null,null,null,null,null,"-",{"$f":"P11","v":"TuS Eversten E5"},null,null,null,null,null,null,null,null,null,null,null,null,null,null,null,null,0,null,":",2,null,4,null,null,null,0,":",3,null,null,null,null,{"$f":"$P$11","v":"TuS Eversten E5"},{"$f":"COUNT($BF$20,$BH$22,$BF$25,$BH$28)","v":4},{"$f":"SUM($BF$20+$BH$22+$BF$25+$BH$28)","v":6},{"$f":"SUM($AW$20+$AZ$22+$AW$25+$AZ$28)","v":6},":",{"$f":"SUM($AZ$20+$AW$22+$AZ$25+$AW$28)","v":6},{"$f":"SUM(BP22-BR22)","v":0}]
[null,4,null,{"$f":"'GR Platzierungsspiele VR'!G$3","v":4},null,null,null,null,null,"10:42:00",null,null,null,null,{"$f":"P12","v":"TuS  Hasbergen"},null,null,null,null,null,null,null,null,null,null,null,null,null,null,null,"-",{"$f":"P13","v":"JSG Riede/Emtinghausen 2"},null,null,null,null,null,null,null,null,null,null,null,null,null,null,null,null,2,null,":",0,null,4,null,null,null,3,":",0,null,null,null,null,{"$f":"$P$13","v":"JSG Riede/Emtinghausen 2"},{"$f":"COUNT($BF$21,$BH$23,$BH$25,$BF$27)","v":4},{"$f":"SUM($BF$21+$BH$23+$BH$25+$BF$27)","v":2},{"$f":"SUM($AW$21+$AZ$23+$AZ$25+$AW$27)","v":1},":",{"$f":"SUM($AZ$21+$AW$23+$AW$25+$AZ$27)","v":5},{"$f":"SUM(BP23-BR23)","v":-4}]
[null,5,null,{"$f":"'GR Platzierungsspiele VR'!G$3","v":4},null,null,null,null,null,"10:56:00",null,null,null,null,{"$f":"P14","v":"TuS Strudden 2"},null,null,null,null,null,null,null,null,null,null,null,null,null,null,null,"-",{"$f":"P15","v":"SV Spetzerfehn"},null,null,null,null,null,null,null,null,null,null,null,null,null,null,null,null,2,null,":",0,null,4,null,null,null,3,":",0,null,null,null,null,{"$f":"$P$15","v":"SV Spetzerfehn"},{"$f":"COUNT($BF$22,$BH$24,$BH$27,$BF$29)","v":4},{"$f":"SUM($BF$22+$BH$24+$BH$27+$BF$29)","v":1},{"$f":"SUM($AW$22+$AZ$24+$AZ$27+$AW$29)","v":1},":",{"$f":"SUM($AZ$22+$AW$24+$AW$27+$AZ$29)","v":8},{"$f":"SUM(BP24-BR24)","v":-7}]
[null,6,null,{"$f":"'GR Platzierungsspiele VR'!G$3","v":4},null,null,null,null,null,"11:10:00",null,null,null,null,{"$f":"P11","v":"TuS Eversten E5"},null,null,null,null,null,null,null,null,null,null,null,null,null,null,null,"-",{"$f":"P13","v":"JSG Riede/Emtinghausen 2"},null,null,null,null,null,null,null,null,null,null,null,null,null,null,null,null,2,null,":",0,null,4,null,null,null,3,":",0]
[null,7,null,{"$f":"'GR Platzierungsspiele VR'!G$3","v":4},null,null,null,null,null,"11:24:00",null,null,null,null,{"$f":"P12","v":"TuS  Hasbergen"},null,null,null,null,null,null,null,null,null,null,null,null,null,null,null,"-",{"$f":"P14","v":"TuS Strudden 2"},null,null,null,null,null,null,null,null,null,null,null,null,null,null,null,null,2,null,":",0,null,4,null,null,null,3,":",0]
[null,8,null,{"$f":"'GR Platzierungsspiele VR'!G$3","v":4},null,null,null,null,null,"12:30:00",null,null,null,null,{"$f":"P13","v":"JSG Riede/Emtinghausen 2"},null,null,null,null,null,null,null,null,null,null,null,null,null,null,null,"-",{"$f":"P15","v":"SV Spetzerfehn"},null,null,null,null,null,null,null,null,null,null,null,null,null,null,null,null,0,null,":",0,null,4,null,null,null,1,":",1]
[null,9,null,{"$f":"'GR Platzierungsspiele VR'!G$3","v":4},null,null,null,null,null,"12:44:00",null,null,null,null,{"$f":"P14","v":"TuS Strudden 2"},null,null,null,null,null,null,null,null,null,null,null,null,null,null,null,"-",{"$f":"P11","v":"TuS Eversten E5"},null,null,null,null,null,null,null,null,null,null,null,null,null,null,null,null,4,null,":",2,null,4,null,null,null,3,":",0]
[null,10,null,{"$f":"'GR Platzierungsspiele VR'!G$3","v":4},null,null,null,null,null,"12:58:00",null,null,null,null,{"$f":"P15","v":"SV Spetzerfehn"},null,null,null,null,null,null,null,null,null,null,null,null,null,null,null,"-",{"$f":"P12","v":"TuS  Hasbergen"},null,null,null,null,null,null,null,null,null,null,null,null,null,null,null,null,1,null,":",4,null,4,null,null,null,0,":",3]
[]
[null,"III. Abschlusstabelle"]
[]
[]
[null,null,null,null,null,null,null,null,"Mannschaften",null,null,null,null,null,null,null,null,null,null,null,null,null,null,null,null,null,null,null,null,null,null,null,null,"Sp.",null,null,"Pkt.",null,null,"Tore",null,null,null,null,"Diff."]
[null,null,null,null,null,null,null,null,"1.",null,{"$f":"BM20","v":"TuS  Hasbergen"},null,null,null,null,null,null,null,null,null,null,null,null,null,null,null,null,null,null,null,null,null,null,{"$f":"BN20","v":4},null,null,{"$f":"BO20","v":12},null,null,{"$f":"BP20","v":10},null,":",{"$f":"BR20","v":1},null,{"$f":"BS20","v":9}]
[null,null,null,null,null,null,null,null,"2.",null,{"$f":"BM21","v":"TuS Strudden 2"},null,null,null,null,null,null,null,null,null,null,null,null,null,null,null,null,null,null,null,null,null,null,{"$f":"BN21","v":4},null,null,{"$f":"BO21","v":7},null,null,{"$f":"BP21","v":7},null,":",{"$f":"BR21","v":5},null,{"$f":"BS21","v":2}]
[null,null,null,null,null,null,null,null,"3.",null,{"$f":"BM22","v":"TuS Eversten E5"},null,null,null,null,null,null,null,null,null,null,null,null,null,null,null,null,null,null,null,null,null,null,{"$f":"BN22","v":4},null,null,{"$f":"BO22","v":6},null,null,{"$f":"BP22","v":6},null,":",{"$f":"BR22","v":6},null,{"$f":"BS22","v":0}]
[null,null,null,null,null,null,null,null,"4.",null,{"$f":"BM23","v":"JSG Riede/Emtinghausen 2"},null,null,null,null,null,null,null,null,null,null,null,null,null,null,null,null,null,null,null,null,null,null,{"$f":"BN23","v":4},null,null,{"$f":"BO23","v":2},null,null,{"$f":"BP23","v":1},null,":",{"$f":"BR23","v":5},null,{"$f":"BS23","v":-4}]
[null,null,null,null,null,null,null,null,"5.",null,{"$f":"BM24","v":"SV Spetzerfehn"},null,null,null,null,null,null,null,null,null,null,null,null,null,null,null,null,null,null,null,null,null,null,{"$f":"BN24","v":4},null,null,{"$f":"BO24","v":1},null,null,{"$f":"BP24","v":1},null,":",{"$f":"BR24","v":8},null,{"$f":"BS24","v":-7}]
[]
["Achtung! Mittagspause zwischen Spiel 7 und 8 !"]

{"sheet":"21 -25","index":13,"n_rows":41,"n_cols":71,"rows_kept":41,"cut":false,"hidden":false,"merged":[[2,0,2,54],[1,0,1,54],[9,13,9,35],[9,36,9,37],[10,13,10,14],[10,15,10,35],[10,36,10,37],[11,13,11,14],[11,15,11,35],[11,36,11,37],[4,7,4,11],[4,20,4,21],[4,23,4,27],[4,37,4,41],[14,13,14,14],[14,15,14,35],[14,36,14,37],[18,1,18,2],[18,3,18,5],[18,6,18,8],[18,9,18,13],[18,14,18,47],[12,13,12,14],[12,15,12,35],[12,36,12,37],[13,13,13,14],[13,15,13,35],[13,36,13,37],[18,48,18,52],[18,53,18,54],[19,1,19,2],[19,3,19,5],[19,6,19,8],[19,9,19,13],[19,14,19,29],[19,31,19,47],[19,48,19,49],[19,51,19,52],[19,53,19,54],[20,1,20,2],[20,3,20,5],[20,6,20,8],[20,9,20,13],[20,14,20,29],[20,31,20,47],[20,48,20,49],[20,51,20,52],[20,53,20,54],[21,48,21,49],[21,51,21,52],[21,53,21,54],[22,1,22,2],[22,3,22,5],[22,6,22,8],[22,9,22,13],[22,14,22,29],[22,31,22,47],[22,48,22,49],[21,1,21,2],[21,3,21,5],[21,6,21,8],[21,9,21,13],[21,14,21,29],[21,31,21,47],[22,51,22,52],[22,53,22,54],[23,1,23,2],[23,3,23,5],[23,6,23,8],[23,9,23,13],[23,14,23,29],[23,31,23,47],[23,48,23,49],[23,51,23,52],[23,53,23,54],[24,1,24,2],[24,3,24,5],[24,6,24,8],[24,9,24,13],[24,14,24,29],[24,31,24,47],[24,48,24,49],[24,51,24,52],[24,53,24,54],[25,48,25,49],[25,51,25,52],[25,53,25,54],[26,1,26,2],[26,3,26,5],[26,6,26,8],[26,9,26,13],[26,14,26,29],[26,31,26,47],[26,48,26,49],[25,1,25,2],[25,3,25,5],[25,6,25,8],[25,9,25,13],[25,14,25,29],[25,31,25,47],[26,51,26,52],[26,53,26,54],[27,1,27,2],[27,3,27,5],[27,6,27,8],[27,9,27,13],[27,14,27,29],[27,31,27,47],[27,48,27,49],[27,51,27,52],[27,53,27,54],[28,1,28,2],[28,3,28,5],[28,6,28,8],[28,9,28,13],[28,14,28,29],[28,31,28,47],[28,48,28,49],[28,51,28,52],[28,53,28,54],[35,8,35,9],[35,10,35,32],[33,8,33,32],[33,33,33,35],[33,36,33,38],[33,39,33,43],[33,44,33,46],[34,8,34,9],[34,10,34,32],[34,33,34,35],[34,36,34,38],[34,39,34,40],[34,42,34,43],[34,44,34,46],[35,33,35,35],[35,36,35,38],[35,39,35,40],[35,42,35,43],[35,44,35,46],[38,44,38,46],[38,8,38,9],[38,10,38,32],[38,33,38,35],[38,36,38,38],[38,39,38,40],[38,42,38,43],[36,44,36,46],[37,8,37,9],[37,10,37,32],[37,33,37,35],[37,36,37,38],[37,39,37,40],[37,42,37,43],[37,44,37,46],[36,8,36,9],[36,10,36,32],[36,33,36,35],[36,36,36,38],[36,39,36,40],[36,42,36,43]]}
[]
["Platzierungsspiele"]
["Platz 21 - 25"]
[]
[null,null,null,null,null,null,"Beginn:","10:00:00",null,null,null,null,"Uhr",null,null,null,null,null,null,"Spielzeit",1,"1x","x","00:12:00",null,null,null,null,"min",null,null,null,null,null,null,null,"Pause:","00:02:00",null,null,null,null,"min"]
[]
[]
[null,"I. Teilnehmende Mannschaften"]
[]
[null,null,null,null,null,null,null,null,null,null,null,null,null,"Gruppeneinteilung",null,null,null,null,null,null,null,null,null,null,null,null,null,null,null,null,null,null,null,null,null,null,"PL"]
[null,null,null,null,null,null,null,null,null,null,null,null,null,"1.",null,{"$f":"'GR Platzierungsspiele VR'!B11","v":"Borussia Salchendorf"},null,null,null,null,null,null,null,null,null,null,null,null,null,null,null,null,null,null,null,null,5]
[null,null,null,null,null,null,null,null,null,null,null,null,null,"2.",null,{"$f":"'GR Platzierungsspiele VR'!B12","v":"SV Warsingsfehn 3"},null,null,null,null,null,null,null,null,null,null,null,null,null,null,null,null,null,null,null,null,5]
[null,null,null,null,null,null,null,null,null,null,null,null,null,"3.",null,{"$f":"'GR Platzierungsspiele VR'!B13","v":"TuS Holthusen"},null,null,null,null,null,null,null,null,null,null,null,null,null,null,null,null,null,null,null,null,5]
[null,null,null,null,null,null,null,null,null,null,null,null,null,"4.",null,{"$f":"'GR Platzierungsspiele VR'!B14","v":"TuS Weener"},null,null,null,null,null,null,null,null,null,null,null,null,null,null,null,null,null,null,null,null,5]
[null,null,null,null,null,null,null,null,null,null,null,null,null,"5.",null,{"$f":"'GR Platzierungsspiele VR'!B15","v":"SV Wallinghausen"},null,null,null,null,null,null,null,null,null,null,null,null,null,null,null,null,null,null,null,null,5]
[]
[null,"II. Spielplan"]
[]
[null,"Nr.",null,"Platz",null,null,null,null,null,"Beginn",null,null,null,null,"Spielpaarungen",null,null,null,null,null,null,null,null,null,null,null,null,null,null,null,null,null,null,null,null,null,null,null,null,null,null,null,null,null,null,null,null,null,"Ergebisse",null,null,null,null,"PL",null,null,null,"Punkte"]
[null,1,null,{"$f":"'GR Platzierungsspiele VR'!C$11","v":5},null,null,null,null,null,{"$f":"$H$5","v":"10:00:00"},null,null,null,null,{"$f":"P11","v":"Borussia Salchendorf"},null,null,null,null,null,null,null,null,null,null,null,null,null,null,null,"-",{"$f":"P12","v":"SV Warsingsfehn 3"},null,null,null,null,null,null,null,null,null,null,null,null,null,null,null,null,2,null,":",0,null,5,null,null,null,{"$f":"IF(ISBLANK(AW20),\"0\",IF(AW20>AZ20,3,IF(AW20=AZ20,1,0)))","v":3},":",{"$f":"IF(ISBLANK(AZ20),\"0\",IF(AZ20>AW20,3,IF(AZ20=AW20,1,0)))","v":0},null,null,null,null,{"$f":"$P$11","v":"Borussia Salchendorf"},{"$f":"COUNT($BF$20,$BH$22,$BF$25,$BH$28)","v":4},{"$f":"SUM($BF$20+$BH$22+$BF$25+$BH$28)","v":10},{"$f":"SUM($AW$20+$AZ$22+$AW$25+$AZ$28)","v":9},":",{"$f":"SUM($AZ$20+$AW$22+$AZ$25+$AW$28)","v":1},{"$f":"SUM(BP20-BR20)","v":8}]
[null,2,null,{"$f":"'GR Platzierungsspiele VR'!C$11","v":5},null,null,null,null,null,{"$f":"J20+$U$5*$X$5+$AL$5","v":"10:14:00"},null,null,null,null,{"$f":"P13","v":"TuS Holthusen"},null,null,null,null,null,null,null,null,null,null,null,null,null,null,null,"-",{"$f":"P14","v":"TuS Weener"},null,null,null,null,null,null,null,null,null,null,null,null,null,null,null,null,0,null,":",2,null,5,null,null,null,{"$f":"IF(ISBLANK(AW21),\"0\",IF(AW21>AZ21,3,IF(AW21=AZ21,1,0)))","v":0},":",{"$f":"IF(ISBLANK(AZ21),\"0\",IF(AZ21>AW21,3,IF(AZ21=AW21,1,0)))","v":3},null,null,null,null,{"$f":"$P$14","v":"TuS Weener"},{"$f":"COUNT($BH$21,$BF$24,$BH$26,$BF$28)","v":4},{"$f":"SUM($BH$21+$BF$24+$BH$26+$BF$28)","v":8},{"$f":"SUM($AZ$21+$AW$24+$AZ$26+$AW$28)","v":4},":",{"$f":"SUM($AW$21+$AZ$24+$AW$26+$AZ$28)","v":1},{"$f":"SUM(BP21-BR21)","v":3}]
[null,3,null,{"$f":"'GR Platzierungsspiele VR'!C$11","v":5},null,null,null,null,null,{"$f":"J21+$U$5*$X$5+$AL$5","v":"10:28:00"},null,null,null,null,{"$f":"P15","v":"SV Wallinghausen"},null,null,null,null,null,null,null,null,null,null,null,null,null,null,null,"-",{"$f":"P11","v":"Borussia Salchendorf"},null,null,null,null,null,null,null,null,null,null,null,null,null,null,null,null,0,null,":",2,null,5,null,null,null,0,":",3,null,null,null,null,{"$f":"$P$12","v":"SV Warsingsfehn 3"},{"$f":"COUNT($BH$20,$BF$23,$BF$26,$BH$29)","v":4},{"$f":"SUM($BH$20+$BF$23+$BF$26+$BH$29)","v":7},{"$f":"SUM($AZ$20+$AW$23+$AW$26+$AZ$29)","v":5},":",{"$f":"SUM($AW$20+$AZ$23+$AZ$26+$AW$29)","v":2},{"$f":"SUM(BP22-BR22)","v":3}]
[null,4,null,{"$f":"'GR Platzierungsspiele VR'!C$11","v":5},null,null,null,null,null,"10:42:00",null,null,null,null,{"$f":"P12","v":"SV Warsingsfehn 3"},null,null,null,null,null,null,null,null,null,null,null,null,null,null,null,"-",{"$f":"P13","v":"TuS Holthusen"},null,null,null,null,null,null,null,null,null,null,null,null,null,null,null,null,3,null,":",0,null,5,null,null,null,3,":",0,null,null,null,null,{"$f":"$P$15","v":"SV Wallinghausen"},{"$f":"COUNT($BF$22,$BH$24,$BH$27,$BF$29)","v":4},{"$f":"SUM($BF$22+$BH$24+$BH$27+$BF$29)","v":3},{"$f":"SUM($AW$22+$AZ$24+$AZ$27+$AW$29)","v":3},":",{"$f":"SUM($AZ$22+$AW$24+$AW$27+$AZ$29)","v":5},{"$f":"SUM(BP23-BR23)","v":-2}]
[null,5,null,{"$f":"'GR Platzierungsspiele VR'!C$11","v":5},null,null,null,null,null,"10:56:00",null,null,null,null,{"$f":"P14","v":"TuS Weener"},null,null,null,null,null,null,null,null,null,null,null,null,null,null,null,"-",{"$f":"P15","v":"SV Wallinghausen"},null,null,null,null,null,null,null,null,null,null,null,null,null,null,null,null,1,null,":",0,null,5,null,null,null,3,":",0,null,null,null,null,{"$f":"$P$13","v":"TuS Holthusen"},{"$f":"COUNT($BF$21,$BH$23,$BH$25,$BF$27)","v":4},{"$f":"SUM($BF$21+$BH$23+$BH$25+$BF$27)","v":0},{"$f":"SUM($AW$21+$AZ$23+$AZ$25+$AW$27)","v":0},":",{"$f":"SUM($AZ$21+$AW$23+$AW$25+$AZ$27)","v":12},{"$f":"SUM(BP24-BR24)","v":-12}]
[null,6,null,{"$f":"'GR Platzierungsspiele VR'!C$11","v":5},null,null,null,null,null,"11:10:00",null,null,null,null,{"$f":"P11","v":"Borussia Salchendorf"},null,null,null,null,null,null,null,null,null,null,null,null,null,null,null,"-",{"$f":"P13","v":"TuS Holthusen"},null,null,null,null,null,null,null,null,null,null,null,null,null,null,null,null,4,null,":",0,null,5,null,null,null,3,":",0]
[null,7,null,{"$f":"'GR Platzierungsspiele VR'!C$11","v":5},null,null,null,null,null,"11:24:00",null,null,null,null,{"$f":"P12","v":"SV Warsingsfehn 3"},null,null,null,null,null,null,null,null,null,null,null,null,null,null,null,"-",{"$f":"P14","v":"TuS Weener"},null,null,null,null,null,null,null,null,null,null,null,null,null,null,null,null,0,null,":",0,null,5,null,null,null,1,":",1]
[null,8,null,{"$f":"'GR Platzierungsspiele VR'!C$11","v":5},null,null,null,null,null,"12:30:00",null,null,null,null,{"$f":"P13","v":"TuS Holthusen"},null,null,null,null,null,null,null,null,null,null,null,null,null,null,null,"-",{"$f":"P15","v":"SV Wallinghausen"},null,null,null,null,null,null,null,null,null,null,null,null,null,null,null,null,0,null,":",3,null,5,null,null,null,0,":",3]
[null,9,null,{"$f":"'GR Platzierungsspiele VR'!C$11","v":5},null,null,null,null,null,"12:44:00",null,null,null,null,{"$f":"P14","v":"TuS Weener"},null,null,null,null,null,null,null,null,null,null,null,null,null,null,null,"-",{"$f":"P11","v":"Borussia Salchendorf"},null,null,null,null,null,null,null,null,null,null,null,null,null,null,null,null,1,null,":",1,null,5,null,null,null,1,":",1]
[null,10,null,{"$f":"'GR Platzierungsspiele VR'!C$11","v":5},null,null,null,null,null,"12:58:00",null,null,null,null,{"$f":"P15","v":"SV Wallinghausen"},null,null,null,null,null,null,null,null,null,null,null,null,null,null,null,"-",{"$f":"P12","v":"SV Warsingsfehn 3"},null,null,null,null,null,null,null,null,null,null,null,null,null,null,null,null,0,null,":",2,null,5,null,null,null,0,":",3]
[]
[null,"III. Abschlusstabelle"]
[]
[]
[null,null,null,null,null,null,null,null,"Mannschaften",null,null,null,null,null,null,null,null,null,null,null,null,null,null,null,null,null,null,null,null,null,null,null,null,"Sp.",null,null,"Pkt.",null,null,"Tore",null,null,null,null,"Diff."]
[null,null,null,null,null,null,null,null,"1.",null,{"$f":"BM20","v":"Borussia Salchendorf"},null,null,null,null,null,null,null,null,null,null,null,null,null,null,null,null,null,null,null,null,null,null,{"$f":"BN20","v":4},null,null,{"$f":"BO20","v":10},null,null,{"$f":"BP20","v":9},null,":",{"$f":"BR20","v":1},null,{"$f":"BS20","v":8}]
[null,null,null,null,null,null,null,null,"2.",null,{"$f":"BM21","v":"TuS Weener"},null,null,null,null,null,null,null,null,null,null,null,null,null,null,null,null,null,null,null,null,null,null,{"$f":"BN21","v":4},null,null,{"$f":"BO21","v":8},null,null,{"$f":"BP21","v":4},null,":",{"$f":"BR21","v":1},null,{"$f":"BS21","v":3}]
[null,null,null,null,null,null,null,null,"3.",null,{"$f":"BM22","v":"SV Warsingsfehn 3"},null,null,null,null,null,null,null,null,null,null,null,null,null,null,null,null,null,null,null,null,null,null,{"$f":"BN22","v":4},null,null,{"$f":"BO22","v":7},null,null,{"$f":"BP22","v":5},null,":",{"$f":"BR22","v":2},null,{"$f":"BS22","v":3}]
[null,null,null,null,null,null,null,null,"4.",null,{"$f":"BM23","v":"SV Wallinghausen"},null,null,null,null,null,null,null,null,null,null,null,null,null,null,null,null,null,null,null,null,null,null,{"$f":"BN23","v":4},null,null,{"$f":"BO23","v":3},null,null,{"$f":"BP23","v":3},null,":",{"$f":"BR23","v":5},null,{"$f":"BS23","v":-2}]
[null,null,null,null,null,null,null,null,"5.",null,{"$f":"BM24","v":"TuS Holthusen"},null,null,null,null,null,null,null,null,null,null,null,null,null,null,null,null,null,null,null,null,null,null,{"$f":"BN24","v":4},null,null,{"$f":"BO24","v":0},null,null,{"$f":"BP24","v":0},null,":",{"$f":"BR24","v":12},null,{"$f":"BS24","v":-12}]
[]
["Achtung! Mittagspause zwischen Spiel 7 und 8 !"]

{"sheet":"26 -30","index":14,"n_rows":41,"n_cols":71,"rows_kept":41,"cut":false,"hidden":false,"merged":[[2,0,2,54],[1,0,1,54],[14,13,14,14],[14,15,14,35],[14,36,14,37],[12,36,12,37],[13,13,13,14],[13,15,13,35],[13,36,13,37],[11,15,11,35],[11,36,11,37],[4,7,4,11],[4,20,4,21],[4,23,4,27],[4,37,4,41],[18,48,18,52],[18,53,18,54],[9,13,9,35],[9,36,9,37],[10,13,10,14],[10,15,10,35],[10,36,10,37],[11,13,11,14],[19,1,19,2],[19,3,19,5],[19,6,19,8],[19,9,19,13],[19,14,19,29],[19,31,19,47],[19,48,19,49],[19,51,19,52],[19,53,19,54],[18,1,18,2],[18,3,18,5],[18,6,18,8],[18,9,18,13],[18,14,18,47],[12,13,12,14],[12,15,12,35],[20,1,20,2],[20,3,20,5],[20,6,20,8],[20,9,20,13],[20,14,20,29],[20,31,20,47],[20,48,20,49],[20,51,20,52],[20,53,20,54],[21,48,21,49],[21,51,21,52],[21,53,21,54],[22,1,22,2],[22,3,22,5],[22,6,22,8],[22,9,22,13],[22,14,22,29],[22,31,22,47],[22,48,22,49],[21,1,21,2],[21,3,21,5],[21,6,21,8],[21,9,21,13],[21,14,21,29],[21,31,21,47],[22,51,22,52],[22,53,22,54],[23,1,23,2],[23,3,23,5],[23,6,23,8],[23,9,23,13],[23,14,23,29],[23,31,23,47],[23,48,23,49],[23,51,23,52],[23,53,23,54],[24,1,24,2],[24,3,24,5],[24,6,24,8],[24,9,24,13],[24,14,24,29],[24,31,24,47],[24,48,24,49],[24,51,24,52],[24,53,24,54],[25,48,25,49],[25,51,25,52],[25,53,25,54],[26,1,26,2],[26,3,26,5],[26,6,26,8],[26,9,26,13],[26,14,26,29],[26,31,26,47],[26,48,26,49],[25,1,25,2],[25,3,25,5],[25,6,25,8],[25,9,25,13],[25,14,25,29],[25,31,25,47],[26,51,26,52],[26,53,26,54],[27,1,27,2],[27,3,27,5],[27,6,27,8],[27,9,27,13],[27,14,27,29],[27,31,27,47],[27,48,27,49],[27,51,27,52],[27,53,27,54],[28,1,28,2],[28,3,28,5],[28,6,28,8],[28,9,28,13],[28,14,28,29],[28,31,28,47],[28,48,28,49],[28,51,28,52],[28,53,28,54],[35,8,35,9],[35,10,35,32],[33,8,33,32],[33,33,33,35],[33,36,33,38],[33,39,33,43],[33,44,33,46],[34,8,34,9],[34,10,34,32],[34,33,34,35],[34,36,34,38],[34,39,34,40],[34,42,34,43],[34,44,34,46],[35,33,35,35],[35,36,35,38],[35,39,35,40],[35,42,35,43],[35,44,35,46],[38,44,38,46],[38,8,38,9],[38,10,38,32],[38,33,38,35],[38,36,38,38],[38,39,38,40],[38,42,38,43],[36,44,36,46],[37,8,37,9],[37,10,37,32],[37,33,37,35],[37,36,37,38],[37,39,37,40],[37,42,37,43],[37,44,37,46],[36,8,36,9],[36,10,36,32],[36,33,36,35],[36,36,36,38],[36,39,36,40],[36,42,36,43]]}
[]
["Platzierungsspiele"]
["Platz 26 - 30"]
[]
[null,null,null,null,null,null,"Beginn:","10:00:00",null,null,null,null,"Uhr",null,null,null,null,null,null,"Spielzeit",1,"1x","x","00:12:00",null,null,null,null,"min",null,null,null,null,null,null,null,"Pause:","00:02:00",null,null,null,null,"min"]
[]
[]
[null,"I. Teilnehmende Mannschaften"]
[]
[null,null,null,null,null,null,null,null,null,null,null,null,null,"Gruppeneinteilung",null,null,null,null,null,null,null,null,null,null,null,null,null,null,null,null,null,null,null,null,null,null,"PL"]
[null,null,null,null,null,null,null,null,null,null,null,null,null,"1.",null,{"$f":"'GR Platzierungsspiele VR'!F11","v":"VfL \"Fortuna\" Veenhusen 3"},null,null,null,null,null,null,null,null,null,null,null,null,null,null,null,null,null,null,null,null,6]
[null,null,null,null,null,null,null,null,null,null,null,null,null,"2.",null,{"$f":"'GR Platzierungsspiele VR'!F12","v":"\"Fortuna\" Veenhusen E-Mädchen"},null,null,null,null,null,null,null,null,null,null,null,null,null,null,null,null,null,null,null,null,6]
[null,null,null,null,null,null,null,null,null,null,null,null,null,"3.",null,{"$f":"'GR Platzierungsspiele VR'!F13","v":"BW Galgenmoor"},null,null,null,null,null,null,null,null,null,null,null,null,null,null,null,null,null,null,null,null,6]
[null,null,null,null,null,null,null,null,null,null,null,null,null,"4.",null,{"$f":"'GR Platzierungsspiele VR'!F14","v":"VfL \"Fortuna\" Veenhusen 2"},null,null,null,null,null,null,null,null,null,null,null,null,null,null,null,null,null,null,null,null,6]
[null,null,null,null,null,null,null,null,null,null,null,null,null,"5.",null,{"$f":"'GR Platzierungsspiele VR'!F15","v":"SV Concordia Neermoor"},null,null,null,null,null,null,null,null,null,null,null,null,null,null,null,null,null,null,null,null,6]
[]
[null,"II. Spielplan"]
[]
[null,"Nr.",null,"Platz",null,null,null,null,null,"Beginn",null,null,null,null,"Spielpaarungen",null,null,null,null,null,null,null,null,null,null,null,null,null,null,null,null,null,null,null,null,null,null,null,null,null,null,null,null,null,null,null,null,null,"Ergebisse",null,null,null,null,"PL",null,null,null,"Punkte"]
[null,1,null,{"$f":"'GR Platzierungsspiele VR'!G$11","v":6},null,null,null,null,null,{"$f":"$H$5","v":"10:00:00"},null,null,null,null,{"$f":"P11","v":"VfL \"Fortuna\" Veenhusen 3"},null,null,null,null,null,null,null,null,null,null,null,null,null,null,null,"-",{"$f":"P12","v":"\"Fortuna\" Veenhusen E-Mädchen"},null,null,null,null,null,null,null,null,null,null,null,null,null,null,null,null,0,null,":",1,null,6,null,null,null,{"$f":"IF(ISBLANK(AW20),\"0\",IF(AW20>AZ20,3,IF(AW20=AZ20,1,0)))","v":0},":",{"$f":"IF(ISBLANK(AZ20),\"0\",IF(AZ20>AW20,3,IF(AZ20=AW20,1,0)))","v":3},null,null,null,null,{"$f":"$P$15","v":"SV Concordia Neermoor"},{"$f":"COUNT($BF$22,$BH$24,$BH$27,$BF$29)","v":4},{"$f":"SUM($BF$22+$BH$24+$BH$27+$BF$29)","v":8},{"$f":"SUM($AW$22+$AZ$24+$AZ$27+$AW$29)","v":4},":",{"$f":"SUM($AZ$22+$AW$24+$AW$27+$AZ$29)","v":0},{"$f":"SUM(BP20-BR20)","v":4}]
[null,2,null,{"$f":"'GR Platzierungsspiele VR'!G$11","v":6},null,null,null,null,null,{"$f":"J20+$U$5*$X$5+$AL$5","v":"10:14:00"},null,null,null,null,{"$f":"P13","v":"BW Galgenmoor"},null,null,null,null,null,null,null,null,null,null,null,null,null,null,null,"-",{"$f":"P14","v":"VfL \"Fortuna\" Veenhusen 2"},null,null,null,null,null,null,null,null,null,null,null,null,null,null,null,null,0,null,":",0,null,6,null,null,null,{"$f":"IF(ISBLANK(AW21),\"0\",IF(AW21>AZ21,3,IF(AW21=AZ21,1,0)))","v":1},":",{"$f":"IF(ISBLANK(AZ21),\"0\",IF(AZ21>AW21,3,IF(AZ21=AW21,1,0)))","v":1},null,null,null,null,{"$f":"$P$12","v":"\"Fortuna\" Veenhusen E-Mädchen"},{"$f":"COUNT($BH$20,$BF$23,$BF$26,$BH$29)","v":4},{"$f":"SUM($BH$20+$BF$23+$BF$26+$BH$29)","v":8},{"$f":"SUM($AZ$20+$AW$23+$AW$26+$AZ$29)","v":4},":",{"$f":"SUM($AW$20+$AZ$23+$AZ$26+$AW$29)","v":1},{"$f":"SUM(BP21-BR21)","v":3}]
[null,3,null,{"$f":"'GR Platzierungsspiele VR'!G$11","v":6},null,null,null,null,null,{"$f":"J21+$U$5*$X$5+$AL$5","v":"10:28:00"},null,null,null,null,{"$f":"P15","v":"SV Concordia Neermoor"},null,null,null,null,null,null,null,null,null,null,null,null,null,null,null,"-",{"$f":"P11","v":"VfL \"Fortuna\" Veenhusen 3"},null,null,null,null,null,null,null,null,null,null,null,null,null,null,null,null,0,null,":",0,null,6,null,null,null,1,":",1,null,null,null,null,{"$f":"$P$11","v":"VfL \"Fortuna\" Veenhusen 3"},{"$f":"COUNT($BF$20,$BH$22,$BF$25,$BH$28)","v":4},{"$f":"SUM($BF$20+$BH$22+$BF$25+$BH$28)","v":5},{"$f":"SUM($AW$20+$AZ$22+$AW$25+$AZ$28)","v":1},":",{"$f":"SUM($AZ$20+$AW$22+$AZ$25+$AW$28)","v":1},{"$f":"SUM(BP22-BR22)","v":0}]
[null,4,null,{"$f":"'GR Platzierungsspiele VR'!G$11","v":6},null,null,null,null,null,"10:42:00",null,null,null,null,{"$f":"P12","v":"\"Fortuna\" Veenhusen E-Mädchen"},null,null,null,null,null,null,null,null,null,null,null,null,null,null,null,"-",{"$f":"P13","v":"BW Galgenmoor"},null,null,null,null,null,null,null,null,null,null,null,null,null,null,null,null,1,null,":",1,null,6,null,null,null,1,":",1,null,null,null,null,{"$f":"$P$14","v":"VfL \"Fortuna\" Veenhusen 2"},{"$f":"COUNT($BH$21,$BF$24,$BH$26,$BF$28)","v":4},{"$f":"SUM($BH$21+$BF$24+$BH$26+$BF$28)","v":2},{"$f":"SUM($AZ$21+$AW$24+$AZ$26+$AW$28)","v":0},":",{"$f":"SUM($AW$21+$AZ$24+$AW$26+$AZ$28)","v":3},{"$f":"SUM(BP23-BR23)","v":-3}]
[null,5,null,{"$f":"'GR Platzierungsspiele VR'!G$11","v":6},null,null,null,null,null,"10:56:00",null,null,null,null,{"$f":"P14","v":"VfL \"Fortuna\" Veenhusen 2"},null,null,null,null,null,null,null,null,null,null,null,null,null,null,null,"-",{"$f":"P15","v":"SV Concordia Neermoor"},null,null,null,null,null,null,null,null,null,null,null,null,null,null,null,null,0,null,":",1,null,6,null,null,null,0,":",3,null,null,null,null,{"$f":"$P$13","v":"BW Galgenmoor"},{"$f":"COUNT($BF$21,$BH$23,$BH$25,$BF$27)","v":4},{"$f":"SUM($BF$21+$BH$23+$BH$25+$BF$27)","v":2},{"$f":"SUM($AW$21+$AZ$23+$AZ$25+$AW$27)","v":1},":",{"$f":"SUM($AZ$21+$AW$23+$AW$25+$AZ$27)","v":5},{"$f":"SUM(BP24-BR24)","v":-4}]
[null,6,null,{"$f":"'GR Platzierungsspiele VR'!G$11","v":6},null,null,null,null,null,"11:10:00",null,null,null,null,{"$f":"P11","v":"VfL \"Fortuna\" Veenhusen 3"},null,null,null,null,null,null,null,null,null,null,null,null,null,null,null,"-",{"$f":"P13","v":"BW Galgenmoor"},null,null,null,null,null,null,null,null,null,null,null,null,null,null,null,null,1,null,":",0,null,6,null,null,null,3,":",0]
[null,7,null,{"$f":"'GR Platzierungsspiele VR'!G$11","v":6},null,null,null,null,null,"11:24:00",null,null,null,null,{"$f":"P12","v":"\"Fortuna\" Veenhusen E-Mädchen"},null,null,null,null,null,null,null,null,null,null,null,null,null,null,null,"-",{"$f":"P14","v":"VfL \"Fortuna\" Veenhusen 2"},null,null,null,null,null,null,null,null,null,null,null,null,null,null,null,null,2,null,":",0,null,6,null,null,null,3,":",0]
[null,8,null,{"$f":"'GR Platzierungsspiele VR'!G$11","v":6},null,null,null,null,null,"12:30:00",null,null,null,null,{"$f":"P13","v":"BW Galgenmoor"},null,null,null,null,null,null,null,null,null,null,null,null,null,null,null,"-",{"$f":"P15","v":"SV Concordia Neermoor"},null,null,null,null,null,null,null,null,null,null,null,null,null,null,null,null,0,null,":",3,null,6,null,null,null,0,":",3]
[null,9,null,{"$f":"'GR Platzierungsspiele VR'!G$11","v":6},null,null,null,null,null,"12:44:00",null,null,null,null,{"$f":"P14","v":"VfL \"Fortuna\" Veenhusen 2"},null,null,null,null,null,null,null,null,null,null,null,null,null,null,null,"-",{"$f":"P11","v":"VfL \"Fortuna\" Veenhusen 3"},null,null,null,null,null,null,null,null,null,null,null,null,null,null,null,null,0,null,":",0,null,6,null,null,null,1,":",1]
[null,10,null,{"$f":"'GR Platzierungsspiele VR'!G$11","v":6},null,null,null,null,null,"12:58:00",null,null,null,null,{"$f":"P15","v":"SV Concordia Neermoor"},null,null,null,null,null,null,null,null,null,null,null,null,null,null,null,"-",{"$f":"P12","v":"\"Fortuna\" Veenhusen E-Mädchen"},null,null,null,null,null,null,null,null,null,null,null,null,null,null,null,null,0,null,":",0,null,6,null,null,null,1,":",1]
[]
[null,"III. Abschlusstabelle"]
[]
[]
[null,null,null,null,null,null,null,null,"Mannschaften",null,null,null,null,null,null,null,null,null,null,null,null,null,null,null,null,null,null,null,null,null,null,null,null,"Sp.",null,null,"Pkt.",null,null,"Tore",null,null,null,null,"Diff."]
[null,null,null,null,null,null,null,null,"1.",null,{"$f":"BM20","v":"SV Concordia Neermoor"},null,null,null,null,null,null,null,null,null,null,null,null,null,null,null,null,null,null,null,null,null,null,{"$f":"BN20","v":4},null,null,{"$f":"BO20","v":8},null,null,{"$f":"BP20","v":4},null,":",{"$f":"BR20","v":0},null,{"$f":"BS20","v":4}]
[null,null,null,null,null,null,null,null,"2.",null,{"$f":"BM21","v":"\"Fortuna\" Veenhusen E-Mädchen"},null,null,null,null,null,null,null,null,null,null,null,null,null,null,null,null,null,null,null,null,null,null,{"$f":"BN21","v":4},null,null,{"$f":"BO21","v":8},null,null,{"$f":"BP21","v":4},null,":",{"$f":"BR21","v":1},null,{"$f":"BS21","v":3}]
[null,null,null,null,null,null,null,null,"3.",null,{"$f":"BM22","v":"VfL \"Fortuna\" Veenhusen 3"},null,null,null,null,null,null,null,null,null,null,null,null,null,null,null,null,null,null,null,null,null,null,{"$f":"BN22","v":4},null,null,{"$f":"BO22","v":5},null,null,{"$f":"BP22","v":1},null,":",{"$f":"BR22","v":1},null,{"$f":"BS22","v":0}]
[null,null,null,null,null,null,null,null,"4.",null,{"$f":"BM23","v":"VfL \"Fortuna\" Veenhusen 2"},null,null,null,null,null,null,null,null,null,null,null,null,null,null,null,null,null,null,null,null,null,null,{"$f":"BN23","v":4},null,null,{"$f":"BO23","v":2},null,null,{"$f":"BP23","v":0},null,":",{"$f":"BR23","v":3},null,{"$f":"BS23","v":-3}]
[null,null,null,null,null,null,null,null,"5.",null,{"$f":"BM24","v":"BW Galgenmoor"},null,null,null,null,null,null,null,null,null,null,null,null,null,null,null,null,null,null,null,null,null,null,{"$f":"BN24","v":4},null,null,{"$f":"BO24","v":2},null,null,{"$f":"BP24","v":1},null,":",{"$f":"BR24","v":5},null,{"$f":"BS24","v":-4}]
[]
["Achtung! Mittagspause zwischen Spiel 7 und 8 !"]

{"sheet":"Platzierungen gesamt","index":15,"n_rows":32,"n_cols":3,"rows_kept":32,"cut":false,"hidden":false,"merged":[]}
[]
["Platz","Teilnehmer","Bild"]
[1,{"$f":"Endrunde!E24","v":"JSG Riede/Emtinghausen 1"},{"$f":"IF(B3=\"\",\"\",VLOOKUP(B3,'VR Gruppeneinteilung'!H$2:I$31,2,FALSE))","v":"E:\\Veenhusen\\E_Turnier_und_Sportwoche\\2012\\Mannschaftsbilder_Urkunde\\66.jpg"}]
[2,{"$f":"Endrunde!E25","v":"Weiße Elf Nordhorn"},{"$f":"IF(B4=\"\",\"\",VLOOKUP(B4,'VR Gruppeneinteilung'!H$2:I$31,2,FALSE))","v":"E:\\Veenhusen\\E_Turnier_und_Sportwoche\\2012\\Mannschaftsbilder_Urkunde\\kein_bild.jpg"}]
[3,{"$f":"Endrunde!E26","v":"BW Papenburg"},{"$f":"IF(B5=\"\",\"\",VLOOKUP(B5,'VR Gruppeneinteilung'!H$2:I$31,2,FALSE))","v":"E:\\Veenhusen\\E_Turnier_und_Sportwoche\\2012\\Mannschaftsbilder_Urkunde\\1.jpg"}]
[4,{"$f":"Endrunde!E27","v":"SF Oesede"},{"$f":"IF(B6=\"\",\"\",VLOOKUP(B6,'VR Gruppeneinteilung'!H$2:I$31,2,FALSE))","v":"E:\\Veenhusen\\E_Turnier_und_Sportwoche\\2012\\Mannschaftsbilder_Urkunde\\kein_bild.jpg"}]
[5,{"$f":"Endrunde!E28","v":"TV Jahn Delmenhorst"},{"$f":"IF(B7=\"\",\"\",VLOOKUP(B7,'VR Gruppeneinteilung'!H$2:I$31,2,FALSE))","v":"E:\\Veenhusen\\E_Turnier_und_Sportwoche\\2012\\Mannschaftsbilder_Urkunde\\kein_bild.jpg"}]
[6,{"$f":"Endrunde!E29","v":"VfL Germania Leer"},{"$f":"IF(B8=\"\",\"\",VLOOKUP(B8,'VR Gruppeneinteilung'!H$2:I$31,2,FALSE))","v":"E:\\Veenhusen\\E_Turnier_und_Sportwoche\\2012\\Mannschaftsbilder_Urkunde\\kein_bild.jpg"}]
[7,{"$f":"Endrunde!E30","v":"TSV Barrien"},{"$f":"IF(B9=\"\",\"\",VLOOKUP(B9,'VR Gruppeneinteilung'!H$2:I$31,2,FALSE))","v":"E:\\Veenhusen\\E_Turnier_und_Sportwoche\\2012\\Mannschaftsbilder_Urkunde\\kein_bild.jpg"}]
[8,{"$f":"Endrunde!E31","v":"VfL \"Fortuna\" Veenhusen 1"},{"$f":"IF(B10=\"\",\"\",VLOOKUP(B10,'VR Gruppeneinteilung'!H$2:I$31,2,FALSE))","v":"E:\\Veenhusen\\E_Turnier_und_Sportwoche\\2012\\Mannschaftsbilder_Urkunde\\kein_bild.jpg"}]
[9,{"$f":"Endrunde!E32","v":"Frisia Loga"},{"$f":"IF(B11=\"\",\"\",VLOOKUP(B11,'VR Gruppeneinteilung'!H$2:I$31,2,FALSE))","v":"E:\\Veenhusen\\E_Turnier_und_Sportwoche\\2012\\Mannschaftsbilder_Urkunde\\66.jpg"}]
[10,{"$f":"Endrunde!E33","v":"VfL Viktoria Flachsmeer"},{"$f":"IF(B12=\"\",\"\",VLOOKUP(B12,'VR Gruppeneinteilung'!H$2:I$31,2,FALSE))","v":"E:\\Veenhusen\\E_Turnier_und_Sportwoche\\2012\\Mannschaftsbilder_Urkunde\\4.jpg"}]
[11,{"$f":"'11 - 15'!K35","v":"FSV Westerstede"},{"$f":"IF(B13=\"\",\"\",VLOOKUP(B13,'VR Gruppeneinteilung'!H$2:I$31,2,FALSE))","v":"E:\\Veenhusen\\E_Turnier_und_Sportwoche\\2012\\Mannschaftsbilder_Urkunde\\66.jpg"}]
[12,{"$f":"'11 - 15'!K36","v":"TuS Strudden 1"},{"$f":"IF(B14=\"\",\"\",VLOOKUP(B14,'VR Gruppeneinteilung'!H$2:I$31,2,FALSE))","v":"E:\\Veenhusen\\E_Turnier_und_Sportwoche\\2012\\Mannschaftsbilder_Urkunde\\kein_bild.jpg"}]
[13,{"$f":"'11 - 15'!K37","v":"TV Apen"},{"$f":"IF(B15=\"\",\"\",VLOOKUP(B15,'VR Gruppeneinteilung'!H$2:I$31,2,FALSE))","v":"E:\\Veenhusen\\E_Turnier_und_Sportwoche\\2012\\Mannschaftsbilder_Urkunde\\kein_bild.jpg"}]
[14,{"$f":"'11 - 15'!K38","v":"JSG Kloster Oesede/Harderberg"},{"$f":"IF(B16=\"\",\"\",VLOOKUP(B16,'VR Gruppeneinteilung'!H$2:I$31,2,FALSE))","v":"E:\\Veenhusen\\E_Turnier_und_Sportwoche\\2012\\Mannschaftsbilder_Urkunde\\66.jpg"}]
[15,{"$f":"'11 - 15'!K39","v":"SV Großefehn"},{"$f":"IF(B17=\"\",\"\",VLOOKUP(B17,'VR Gruppeneinteilung'!H$2:I$31,2,FALSE))","v":"E:\\Veenhusen\\E_Turnier_und_Sportwoche\\2012\\Mannschaftsbilder_Urkunde\\kein_bild.jpg"}]
[16,{"$f":"'16 - 20'!K35","v":"TuS  Hasbergen"},{"$f":"IF(B18=\"\",\"\",VLOOKUP(B18,'VR Gruppeneinteilung'!H$2:I$31,2,FALSE))","v":"E:\\Veenhusen\\E_Turnier_und_Sportwoche\\2012\\Mannschaftsbilder_Urkunde\\66.jpg"}]
[17,{"$f":"'16 - 20'!K36","v":"TuS Strudden 2"},{"$f":"IF(B19=\"\",\"\",VLOOKUP(B19,'VR Gruppeneinteilung'!H$2:I$31,2,FALSE))","v":"E:\\Veenhusen\\E_Turnier_und_Sportwoche\\2012\\Mannschaftsbilder_Urkunde\\kein_bild.jpg"}]
[18,{"$f":"'16 - 20'!K37","v":"TuS Eversten E5"},{"$f":"IF(B20=\"\",\"\",VLOOKUP(B20,'VR Gruppeneinteilung'!H$2:I$31,2,FALSE))","v":"E:\\Veenhusen\\E_Turnier_und_Sportwoche\\2012\\Mannschaftsbilder_Urkunde\\2.jpg"}]
[19,{"$f":"'16 - 20'!K38","v":"JSG Riede/Emtinghausen 2"},{"$f":"IF(B21=\"\",\"\",VLOOKUP(B21,'VR Gruppeneinteilung'!H$2:I$31,2,FALSE))","v":"E:\\Veenhusen\\E_Turnier_und_Sportwoche\\2012\\Mannschaftsbilder_Urkunde\\kein_bild.jpg"}]
[20,{"$f":"'16 - 20'!K39","v":"SV Spetzerfehn"},{"$f":"IF(B22=\"\",\"\",VLOOKUP(B22,'VR Gruppeneinteilung'!H$2:I$31,2,FALSE))","v":"E:\\Veenhusen\\E_Turnier_und_Sportwoche\\2012\\Mannschaftsbilder_Urkunde\\kein_bild.jpg"}]
[21,{"$f":"'21 -25'!K35","v":"Borussia Salchendorf"},{"$f":"IF(B23=\"\",\"\",VLOOKUP(B23,'VR Gruppeneinteilung'!H$2:I$31,2,FALSE))","v":"E:\\Veenhusen\\E_Turnier_und_Sportwoche\\2012\\Mannschaftsbilder_Urkunde\\3.jpg"}]
[22,{"$f":"'21 -25'!K36","v":"TuS Weener"},{"$f":"IF(B24=\"\",\"\",VLOOKUP(B24,'VR Gruppeneinteilung'!H$2:I$31,2,FALSE))","v":"E:\\Veenhusen\\E_Turnier_und_Sportwoche\\2012\\Mannschaftsbilder_Urkunde\\kein_bild.jpg"}]
[23,{"$f":"'21 -25'!K37","v":"SV Warsingsfehn 3"},{"$f":"IF(B25=\"\",\"\",VLOOKUP(B25,'VR Gruppeneinteilung'!H$2:I$31,2,FALSE))","v":"E:\\Veenhusen\\E_Turnier_und_Sportwoche\\2012\\Mannschaftsbilder_Urkunde\\66.jpg"}]
[24,{"$f":"'21 -25'!K38","v":"SV Wallinghausen"},{"$f":"IF(B26=\"\",\"\",VLOOKUP(B26,'VR Gruppeneinteilung'!H$2:I$31,2,FALSE))","v":"E:\\Veenhusen\\E_Turnier_und_Sportwoche\\2012\\Mannschaftsbilder_Urkunde\\kein_bild.jpg"}]
[25,{"$f":"'21 -25'!K39","v":"TuS Holthusen"},{"$f":"IF(B27=\"\",\"\",VLOOKUP(B27,'VR Gruppeneinteilung'!H$2:I$31,2,FALSE))","v":"E:\\Veenhusen\\E_Turnier_und_Sportwoche\\2012\\Mannschaftsbilder_Urkunde\\kein_bild.jpg"}]
[26,{"$f":"'26 -30'!K35","v":"SV Concordia Neermoor"},{"$f":"IF(B28=\"\",\"\",VLOOKUP(B28,'VR Gruppeneinteilung'!H$2:I$31,2,FALSE))","v":"E:\\Veenhusen\\E_Turnier_und_Sportwoche\\2012\\Mannschaftsbilder_Urkunde\\kein_bild.jpg"}]
[27,{"$f":"'26 -30'!K36","v":"\"Fortuna\" Veenhusen E-Mädchen"},{"$f":"IF(B29=\"\",\"\",VLOOKUP(B29,'VR Gruppeneinteilung'!H$2:I$31,2,FALSE))","v":"E:\\Veenhusen\\E_Turnier_und_Sportwoche\\2012\\Mannschaftsbilder_Urkunde\\66.jpg"}]
[28,{"$f":"'26 -30'!K37","v":"VfL \"Fortuna\" Veenhusen 3"},{"$f":"IF(B30=\"\",\"\",VLOOKUP(B30,'VR Gruppeneinteilung'!H$2:I$31,2,FALSE))","v":"E:\\Veenhusen\\E_Turnier_und_Sportwoche\\2012\\Mannschaftsbilder_Urkunde\\66.jpg"}]
[29,{"$f":"'26 -30'!K38","v":"VfL \"Fortuna\" Veenhusen 2"},{"$f":"IF(B31=\"\",\"\",VLOOKUP(B31,'VR Gruppeneinteilung'!H$2:I$31,2,FALSE))","v":"E:\\Veenhusen\\E_Turnier_und_Sportwoche\\2012\\Mannschaftsbilder_Urkunde\\kein_bild.jpg"}]
[30,{"$f":"'26 -30'!K39","v":"BW Galgenmoor"},{"$f":"IF(B32=\"\",\"\",VLOOKUP(B32,'VR Gruppeneinteilung'!H$2:I$31,2,FALSE))","v":"E:\\Veenhusen\\E_Turnier_und_Sportwoche\\2012\\Mannschaftsbilder_Urkunde\\kein_bild.jpg"}]

{"sheet":"Lauf VRGA","index":16,"n_rows":31,"n_cols":6,"rows_kept":31,"cut":false,"hidden":false,"merged":[]}
["Platz","Gruppe","Anstoss","Mannschaft 1","Mannschaft 2","Ergebnis"]
[{"$f":"'VR Gruppeneinteilung'!C3","v":1},"A",{"$f":"'VR Gruppe A'!D21","v":"14:00:00"},{"$f":"'VR Gruppe A'!I21","v":"BW Papenburg"},{"$f":"'VR Gruppe A'!AC21","v":"TuS Eversten E5"},"__:__"]
["Platz","Gruppe","Anstoss","Mannschaft 1","Mannschaft 2","Ergebnis"]
[{"$f":"$A$2","v":1},{"$f":"$B$2","v":"A"},{"$f":"'VR Gruppe A'!D22","v":"14:17:00"},{"$f":"'VR Gruppe A'!I22","v":"Borussia Salchendorf"},{"$f":"'VR Gruppe A'!AC22","v":"VfL Viktoria Flachsmeer"},"__:__"]
["Platz","Gruppe","Anstoss","Mannschaft 1","Mannschaft 2","Ergebnis"]
[{"$f":"$A$2","v":1},{"$f":"$B$2","v":"A"},{"$f":"'VR Gruppe A'!D23","v":"14:34:00"},{"$f":"'VR Gruppe A'!I23","v":"VfL \"Fortuna\" Veenhusen 3"},{"$f":"'VR Gruppe A'!AC23","v":"JSG Kloster Oesede/Harderberg"},"__:__"]
["Platz","Gruppe","Anstoss","Mannschaft 1","Mannschaft 2","Ergebnis"]
[{"$f":"$A$2","v":1},"A",{"$f":"'VR Gruppe A'!D24","v":"14:51:00"},{"$f":"'VR Gruppe A'!I24","v":"BW Papenburg"},{"$f":"'VR Gruppe A'!AC24","v":"Borussia Salchendorf"},"__:__"]
["Platz","Gruppe","Anstoss","Mannschaft 1","Mannschaft 2","Ergebnis"]
[{"$f":"$A$2","v":1},"A",{"$f":"'VR Gruppe A'!D25","v":"15:08:00"},{"$f":"'VR Gruppe A'!I25","v":"TuS Eversten E5"},{"$f":"'VR Gruppe A'!AC25","v":"VfL \"Fortuna\" Veenhusen 3"},"__:__"]
["Platz","Gruppe","Anstoss","Mannschaft 1","Mannschaft 2","Ergebnis"]
[{"$f":"$A$2","v":1},"A",{"$f":"'VR Gruppe A'!D26","v":"15:25:00"},{"$f":"'VR Gruppe A'!I26","v":"VfL Viktoria Flachsmeer"},{"$f":"'VR Gruppe A'!AC26","v":"JSG Kloster Oesede/Harderberg"},"__:__"]
["Platz","Gruppe","Anstoss","Mannschaft 1","Mannschaft 2","Ergebnis"]
[{"$f":"$A$2","v":1},"A",{"$f":"'VR Gruppe A'!D27","v":"15:42:00"},{"$f":"'VR Gruppe A'!I27","v":"VfL \"Fortuna\" Veenhusen 3"},{"$f":"'VR Gruppe A'!AC27","v":"BW Papenburg"},"__:__"]
["Platz","Gruppe","Anstoss","Mannschaft 1","Mannschaft 2","Ergebnis"]
[{"$f":"$A$2","v":1},"A",{"$f":"'VR Gruppe A'!D28","v":"15:59:00"},{"$f":"'VR Gruppe A'!I28","v":"TuS Eversten E5"},{"$f":"'VR Gruppe A'!AC28","v":"VfL Viktoria Flachsmeer"},"__:__"]
[]
["Platz","Gruppe","Anstoss","Mannschaft 1","Mannschaft 2","Ergebnis"]
[{"$f":"$A$2","v":1},"A",{"$f":"'VR Gruppe A'!D29","v":"16:16:00"},{"$f":"'VR Gruppe A'!I29","v":"JSG Kloster Oesede/Harderberg"},{"$f":"'VR Gruppe A'!AC29","v":"Borussia Salchendorf"},"__:__"]
["Platz","Gruppe","Anstoss","Mannschaft 1","Mannschaft 2","Ergebnis"]
[{"$f":"$A$2","v":1},"A",{"$f":"'VR Gruppe A'!D30","v":"16:33:00"},{"$f":"'VR Gruppe A'!I30","v":"BW Papenburg"},{"$f":"'VR Gruppe A'!AC30","v":"VfL Viktoria Flachsmeer"},"__:__"]
["Platz","Gruppe","Anstoss","Mannschaft 1","Mannschaft 2","Ergebnis"]
[{"$f":"$A$2","v":1},"A",{"$f":"'VR Gruppe A'!D31","v":"16:50:00"},{"$f":"'VR Gruppe A'!I31","v":"JSG Kloster Oesede/Harderberg"},{"$f":"'VR Gruppe A'!AC31","v":"TuS Eversten E5"},"__:__"]
["Platz","Gruppe","Anstoss","Mannschaft 1","Mannschaft 2","Ergebnis"]
[1,"A",{"$f":"'VR Gruppe A'!D32","v":"17:07:00"},{"$f":"'VR Gruppe A'!I32","v":"Borussia Salchendorf"},{"$f":"'VR Gruppe A'!AC32","v":"VfL \"Fortuna\" Veenhusen 3"},"__:__"]
["Platz","Gruppe","Anstoss","Mannschaft 1","Mannschaft 2","Ergebnis"]
[1,"A",{"$f":"'VR Gruppe A'!D33","v":"17:24:00"},{"$f":"'VR Gruppe A'!I33","v":"JSG Kloster Oesede/Harderberg"},{"$f":"'VR Gruppe A'!AC33","v":"BW Papenburg"},"__:__"]
["Platz","Gruppe","Anstoss","Mannschaft 1","Mannschaft 2","Ergebnis"]
[1,"A",{"$f":"'VR Gruppe A'!D34","v":"17:41:00"},{"$f":"'VR Gruppe A'!I34","v":"TuS Eversten E5"},{"$f":"'VR Gruppe A'!AC34","v":"Borussia Salchendorf"},"__:__"]
["Platz","Gruppe","Anstoss","Mannschaft 1","Mannschaft 2","Ergebnis"]
[1,"A",{"$f":"'VR Gruppe A'!D35","v":"17:58:00"},{"$f":"'VR Gruppe A'!I35","v":"VfL Viktoria Flachsmeer"},{"$f":"'VR Gruppe A'!AC35","v":"VfL \"Fortuna\" Veenhusen 3"},"__:__"]

{"sheet":"Lauf VRGB","index":17,"n_rows":31,"n_cols":6,"rows_kept":31,"cut":false,"hidden":false,"merged":[]}
["Platz","Gruppe","Anstoss","Mannschaft 1","Mannschaft 2","Ergebnis"]
[{"$f":"'VR Gruppeneinteilung'!G3","v":2},"A",{"$f":"'VR Gruppe B'!D21","v":"14:00:00"},{"$f":"'VR Gruppe B'!I21","v":"Frisia Loga"},{"$f":"'VR Gruppe B'!AC21","v":"\"Fortuna\" Veenhusen E-Mädchen"},"__:__"]
["Platz","Gruppe","Anstoss","Mannschaft 1","Mannschaft 2","Ergebnis"]
[{"$f":"$A$2","v":2},{"$f":"$B$2","v":"A"},{"$f":"'VR Gruppe B'!D22","v":"14:17:00"},{"$f":"'VR Gruppe B'!I22","v":"TuS  Hasbergen"},{"$f":"'VR Gruppe B'!AC22","v":"FSV Westerstede"},"__:__"]
["Platz","Gruppe","Anstoss","Mannschaft 1","Mannschaft 2","Ergebnis"]
[{"$f":"$A$2","v":2},{"$f":"$B$2","v":"A"},{"$f":"'VR Gruppe B'!D23","v":"14:34:00"},{"$f":"'VR Gruppe B'!I23","v":"JSG Riede/Emtinghausen 1"},{"$f":"'VR Gruppe B'!AC23","v":"SV Warsingsfehn 3"},"__:__"]
["Platz","Gruppe","Anstoss","Mannschaft 1","Mannschaft 2","Ergebnis"]
[{"$f":"$A$2","v":2},"A",{"$f":"'VR Gruppe B'!D24","v":"14:51:00"},{"$f":"'VR Gruppe B'!I24","v":"Frisia Loga"},{"$f":"'VR Gruppe B'!AC24","v":"TuS  Hasbergen"},"__:__"]
["Platz","Gruppe","Anstoss","Mannschaft 1","Mannschaft 2","Ergebnis"]
[{"$f":"$A$2","v":2},"A",{"$f":"'VR Gruppe B'!D25","v":"15:08:00"},{"$f":"'VR Gruppe B'!I25","v":"\"Fortuna\" Veenhusen E-Mädchen"},{"$f":"'VR Gruppe B'!AC25","v":"JSG Riede/Emtinghausen 1"},"__:__"]
["Platz","Gruppe","Anstoss","Mannschaft 1","Mannschaft 2","Ergebnis"]
[{"$f":"$A$2","v":2},"A",{"$f":"'VR Gruppe B'!D26","v":"15:25:00"},{"$f":"'VR Gruppe B'!I26","v":"FSV Westerstede"},{"$f":"'VR Gruppe B'!AC26","v":"SV Warsingsfehn 3"},"__:__"]
["Platz","Gruppe","Anstoss","Mannschaft 1","Mannschaft 2","Ergebnis"]
[{"$f":"$A$2","v":2},"A",{"$f":"'VR Gruppe B'!D27","v":"15:42:00"},{"$f":"'VR Gruppe B'!I27","v":"JSG Riede/Emtinghausen 1"},{"$f":"'VR Gruppe B'!AC27","v":"Frisia Loga"},"__:__"]
["Platz","Gruppe","Anstoss","Mannschaft 1","Mannschaft 2","Ergebnis"]
[{"$f":"$A$2","v":2},"A",{"$f":"'VR Gruppe B'!D28","v":"15:59:00"},{"$f":"'VR Gruppe B'!I28","v":"\"Fortuna\" Veenhusen E-Mädchen"},{"$f":"'VR Gruppe B'!AC28","v":"FSV Westerstede"},"__:__"]
[]
["Platz","Gruppe","Anstoss","Mannschaft 1","Mannschaft 2","Ergebnis"]
[{"$f":"$A$2","v":2},"A",{"$f":"'VR Gruppe B'!D29","v":"16:16:00"},{"$f":"'VR Gruppe B'!I29","v":"SV Warsingsfehn 3"},{"$f":"'VR Gruppe B'!AC29","v":"TuS  Hasbergen"},"__:__"]
["Platz","Gruppe","Anstoss","Mannschaft 1","Mannschaft 2","Ergebnis"]
[{"$f":"$A$2","v":2},"A",{"$f":"'VR Gruppe B'!D30","v":"16:33:00"},{"$f":"'VR Gruppe B'!I30","v":"Frisia Loga"},{"$f":"'VR Gruppe B'!AC30","v":"FSV Westerstede"},"__:__"]
["Platz","Gruppe","Anstoss","Mannschaft 1","Mannschaft 2","Ergebnis"]
[{"$f":"$A$2","v":2},"A",{"$f":"'VR Gruppe B'!D31","v":"16:50:00"},{"$f":"'VR Gruppe B'!I31","v":"SV Warsingsfehn 3"},{"$f":"'VR Gruppe B'!AC31","v":"\"Fortuna\" Veenhusen E-Mädchen"},"__:__"]
["Platz","Gruppe","Anstoss","Mannschaft 1","Mannschaft 2","Ergebnis"]
[2,"A",{"$f":"'VR Gruppe B'!D32","v":"17:07:00"},{"$f":"'VR Gruppe B'!I32","v":"TuS  Hasbergen"},{"$f":"'VR Gruppe B'!AC32","v":"JSG Riede/Emtinghausen 1"},"__:__"]
["Platz","Gruppe","Anstoss","Mannschaft 1","Mannschaft 2","Ergebnis"]
[2,"A",{"$f":"'VR Gruppe B'!D33","v":"17:24:00"},{"$f":"'VR Gruppe B'!I33","v":"SV Warsingsfehn 3"},{"$f":"'VR Gruppe B'!AC33","v":"Frisia Loga"},"__:__"]
["Platz","Gruppe","Anstoss","Mannschaft 1","Mannschaft 2","Ergebnis"]
[2,"A",{"$f":"'VR Gruppe B'!D34","v":"17:41:00"},{"$f":"'VR Gruppe B'!I34","v":"\"Fortuna\" Veenhusen E-Mädchen"},{"$f":"'VR Gruppe B'!AC34","v":"TuS  Hasbergen"},"__:__"]
["Platz","Gruppe","Anstoss","Mannschaft 1","Mannschaft 2","Ergebnis"]
[2,"A",{"$f":"'VR Gruppe B'!D35","v":"17:58:00"},{"$f":"'VR Gruppe B'!I35","v":"FSV Westerstede"},{"$f":"'VR Gruppe B'!AC35","v":"JSG Riede/Emtinghausen 1"},"__:__"]

{"sheet":"Lauf VRGC","index":18,"n_rows":31,"n_cols":6,"rows_kept":31,"cut":false,"hidden":false,"merged":[]}
["Platz","Gruppe","Anstoss","Mannschaft 1","Mannschaft 2","Ergebnis"]
[{"$f":"'VR Gruppeneinteilung'!C12","v":3},"A",{"$f":"'VR Gruppe C'!D21","v":"14:00:00"},{"$f":"'VR Gruppe C'!I21","v":"VfL \"Fortuna\" Veenhusen 1"},{"$f":"'VR Gruppe C'!AC21","v":"TV Jahn Delmenhorst"},"__:__"]
["Platz","Gruppe","Anstoss","Mannschaft 1","Mannschaft 2","Ergebnis"]
[{"$f":"$A$2","v":3},{"$f":"$B$2","v":"A"},{"$f":"'VR Gruppe C'!D22","v":"14:17:00"},{"$f":"'VR Gruppe C'!I22","v":"JSG Riede/Emtinghausen 2"},{"$f":"'VR Gruppe C'!AC22","v":"TuS Holthusen"},"__:__"]
["Platz","Gruppe","Anstoss","Mannschaft 1","Mannschaft 2","Ergebnis"]
[{"$f":"$A$2","v":3},{"$f":"$B$2","v":"A"},{"$f":"'VR Gruppe C'!D23","v":"14:34:00"},{"$f":"'VR Gruppe C'!I23","v":"TuS Strudden 1"},{"$f":"'VR Gruppe C'!AC23","v":"BW Galgenmoor"},"__:__"]
["Platz","Gruppe","Anstoss","Mannschaft 1","Mannschaft 2","Ergebnis"]
[{"$f":"$A$2","v":3},"A",{"$f":"'VR Gruppe C'!D24","v":"14:51:00"},{"$f":"'VR Gruppe C'!I24","v":"VfL \"Fortuna\" Veenhusen 1"},{"$f":"'VR Gruppe C'!AC24","v":"JSG Riede/Emtinghausen 2"},"__:__"]
["Platz","Gruppe","Anstoss","Mannschaft 1","Mannschaft 2","Ergebnis"]
[{"$f":"$A$2","v":3},"A",{"$f":"'VR Gruppe C'!D25","v":"15:08:00"},{"$f":"'VR Gruppe C'!I25","v":"TV Jahn Delmenhorst"},{"$f":"'VR Gruppe C'!AC25","v":"TuS Strudden 1"},"__:__"]
["Platz","Gruppe","Anstoss","Mannschaft 1","Mannschaft 2","Ergebnis"]
[{"$f":"$A$2","v":3},"A",{"$f":"'VR Gruppe C'!D26","v":"15:25:00"},{"$f":"'VR Gruppe C'!I26","v":"TuS Holthusen"},{"$f":"'VR Gruppe C'!AC26","v":"BW Galgenmoor"},"__:__"]
["Platz","Gruppe","Anstoss","Mannschaft 1","Mannschaft 2","Ergebnis"]
[{"$f":"$A$2","v":3},"A",{"$f":"'VR Gruppe C'!D27","v":"15:42:00"},{"$f":"'VR Gruppe C'!I27","v":"TuS Strudden 1"},{"$f":"'VR Gruppe C'!AC27","v":"VfL \"Fortuna\" Veenhusen 1"},"__:__"]
["Platz","Gruppe","Anstoss","Mannschaft 1","Mannschaft 2","Ergebnis"]
[{"$f":"$A$2","v":3},"A",{"$f":"'VR Gruppe C'!D28","v":"15:59:00"},{"$f":"'VR Gruppe C'!I28","v":"TV Jahn Delmenhorst"},{"$f":"'VR Gruppe C'!AC28","v":"TuS Holthusen"},"__:__"]
[]
["Platz","Gruppe","Anstoss","Mannschaft 1","Mannschaft 2","Ergebnis"]
[{"$f":"$A$2","v":3},"A",{"$f":"'VR Gruppe C'!D29","v":"16:16:00"},{"$f":"'VR Gruppe C'!I29","v":"BW Galgenmoor"},{"$f":"'VR Gruppe C'!AC29","v":"JSG Riede/Emtinghausen 2"},"__:__"]
["Platz","Gruppe","Anstoss","Mannschaft 1","Mannschaft 2","Ergebnis"]
[{"$f":"$A$2","v":3},"A",{"$f":"'VR Gruppe C'!D30","v":"16:33:00"},{"$f":"'VR Gruppe C'!I30","v":"VfL \"Fortuna\" Veenhusen 1"},{"$f":"'VR Gruppe C'!AC30","v":"TuS Holthusen"},"__:__"]
["Platz","Gruppe","Anstoss","Mannschaft 1","Mannschaft 2","Ergebnis"]
[{"$f":"$A$2","v":3},"A",{"$f":"'VR Gruppe C'!D31","v":"16:50:00"},{"$f":"'VR Gruppe C'!I31","v":"BW Galgenmoor"},{"$f":"'VR Gruppe C'!AC31","v":"TV Jahn Delmenhorst"},"__:__"]
["Platz","Gruppe","Anstoss","Mannschaft 1","Mannschaft 2","Ergebnis"]
[3,"A",{"$f":"'VR Gruppe C'!D32","v":"17:07:00"},{"$f":"'VR Gruppe C'!I32","v":"JSG Riede/Emtinghausen 2"},{"$f":"'VR Gruppe C'!AC32","v":"TuS Strudden 1"},"__:__"]
["Platz","Gruppe","Anstoss","Mannschaft 1","Mannschaft 2","Ergebnis"]
[3,"A",{"$f":"'VR Gruppe C'!D33","v":"17:24:00"},{"$f":"'VR Gruppe C'!I33","v":"BW Galgenmoor"},{"$f":"'VR Gruppe C'!AC33","v":"VfL \"Fortuna\" Veenhusen 1"},"__:__"]
["Platz","Gruppe","Anstoss","Mannschaft 1","Mannschaft 2","Ergebnis"]
[3,"A",{"$f":"'VR Gruppe C'!D34","v":"17:41:00"},{"$f":"'VR Gruppe C'!I34","v":"TV Jahn Delmenhorst"},{"$f":"'VR Gruppe C'!AC34","v":"JSG Riede/Emtinghausen 2"},"__:__"]
["Platz","Gruppe","Anstoss","Mannschaft 1","Mannschaft 2","Ergebnis"]
[3,"A",{"$f":"'VR Gruppe C'!D35","v":"17:58:00"},{"$f":"'VR Gruppe C'!I35","v":"TuS Holthusen"},{"$f":"'VR Gruppe C'!AC35","v":"TuS Strudden 1"},"__:__"]

{"sheet":"Lauf VRGD","index":19,"n_rows":31,"n_cols":6,"rows_kept":31,"cut":false,"hidden":false,"merged":[]}
["Platz","Gruppe","Anstoss","Mannschaft 1","Mannschaft 2","Ergebnis"]
[{"$f":"'VR Gruppeneinteilung'!G12","v":4},"A",{"$f":"'VR Gruppe D'!D21","v":"14:00:00"},{"$f":"'VR Gruppe D'!I21","v":"VfL Germania Leer"},{"$f":"'VR Gruppe D'!AC21","v":"SV Großefehn"},"__:__"]
["Platz","Gruppe","Anstoss","Mannschaft 1","Mannschaft 2","Ergebnis"]
[{"$f":"$A$2","v":4},{"$f":"$B$2","v":"A"},{"$f":"'VR Gruppe D'!D22","v":"14:17:00"},{"$f":"'VR Gruppe D'!I22","v":"VfL \"Fortuna\" Veenhusen 2"},{"$f":"'VR Gruppe D'!AC22","v":"TuS Strudden 2"},"__:__"]
["Platz","Gruppe","Anstoss","Mannschaft 1","Mannschaft 2","Ergebnis"]
[{"$f":"$A$2","v":4},{"$f":"$B$2","v":"A"},{"$f":"'VR Gruppe D'!D23","v":"14:34:00"},{"$f":"'VR Gruppe D'!I23","v":"TSV Barrien"},{"$f":"'VR Gruppe D'!AC23","v":"TuS Weener"},"__:__"]
["Platz","Gruppe","Anstoss","Mannschaft 1","Mannschaft 2","Ergebnis"]
[{"$f":"$A$2","v":4},"A",{"$f":"'VR Gruppe D'!D24","v":"14:51:00"},{"$f":"'VR Gruppe D'!I24","v":"VfL Germania Leer"},{"$f":"'VR Gruppe D'!AC24","v":"VfL \"Fortuna\" Veenhusen 2"},"__:__"]
["Platz","Gruppe","Anstoss","Mannschaft 1","Mannschaft 2","Ergebnis"]
[{"$f":"$A$2","v":4},"A",{"$f":"'VR Gruppe D'!D25","v":"15:08:00"},{"$f":"'VR Gruppe D'!I25","v":"SV Großefehn"},{"$f":"'VR Gruppe D'!AC25","v":"TSV Barrien"},"__:__"]
["Platz","Gruppe","Anstoss","Mannschaft 1","Mannschaft 2","Ergebnis"]
[{"$f":"$A$2","v":4},"A",{"$f":"'VR Gruppe D'!D26","v":"15:25:00"},{"$f":"'VR Gruppe D'!I26","v":"TuS Strudden 2"},{"$f":"'VR Gruppe D'!AC26","v":"TuS Weener"},"__:__"]
["Platz","Gruppe","Anstoss","Mannschaft 1","Mannschaft 2","Ergebnis"]
[{"$f":"$A$2","v":4},"A",{"$f":"'VR Gruppe D'!D27","v":"15:42:00"},{"$f":"'VR Gruppe D'!I27","v":"TSV Barrien"},{"$f":"'VR Gruppe D'!AC27","v":"VfL Germania Leer"},"__:__"]
["Platz","Gruppe","Anstoss","Mannschaft 1","Mannschaft 2","Ergebnis"]
[{"$f":"$A$2","v":4},"A",{"$f":"'VR Gruppe D'!D28","v":"15:59:00"},{"$f":"'VR Gruppe D'!I28","v":"SV Großefehn"},{"$f":"'VR Gruppe D'!AC28","v":"TuS Strudden 2"},"__:__"]
[]
["Platz","Gruppe","Anstoss","Mannschaft 1","Mannschaft 2","Ergebnis"]
[{"$f":"$A$2","v":4},"A",{"$f":"'VR Gruppe D'!D29","v":"16:16:00"},{"$f":"'VR Gruppe D'!I29","v":"TuS Weener"},{"$f":"'VR Gruppe D'!AC29","v":"VfL \"Fortuna\" Veenhusen 2"},"__:__"]
["Platz","Gruppe","Anstoss","Mannschaft 1","Mannschaft 2","Ergebnis"]
[{"$f":"$A$2","v":4},"A",{"$f":"'VR Gruppe D'!D30","v":"16:33:00"},{"$f":"'VR Gruppe D'!I30","v":"VfL Germania Leer"},{"$f":"'VR Gruppe D'!AC30","v":"TuS Strudden 2"},"__:__"]
["Platz","Gruppe","Anstoss","Mannschaft 1","Mannschaft 2","Ergebnis"]
[{"$f":"$A$2","v":4},"A",{"$f":"'VR Gruppe D'!D31","v":"16:50:00"},{"$f":"'VR Gruppe D'!I31","v":"TuS Weener"},{"$f":"'VR Gruppe D'!AC31","v":"SV Großefehn"},"__:__"]
["Platz","Gruppe","Anstoss","Mannschaft 1","Mannschaft 2","Ergebnis"]
[4,"A",{"$f":"'VR Gruppe D'!D32","v":"17:07:00"},{"$f":"'VR Gruppe D'!I32","v":"VfL \"Fortuna\" Veenhusen 2"},{"$f":"'VR Gruppe D'!AC32","v":"TSV Barrien"},"__:__"]
["Platz","Gruppe","Anstoss","Mannschaft 1","Mannschaft 2","Ergebnis"]
[4,"A",{"$f":"'VR Gruppe D'!D33","v":"17:24:00"},{"$f":"'VR Gruppe D'!I33","v":"TuS Weener"},{"$f":"'VR Gruppe D'!AC33","v":"VfL Germania Leer"},"__:__"]
["Platz","Gruppe","Anstoss","Mannschaft 1","Mannschaft 2","Ergebnis"]
[4,"A",{"$f":"'VR Gruppe D'!D34","v":"17:41:00"},{"$f":"'VR Gruppe D'!I34","v":"SV Großefehn"},{"$f":"'VR Gruppe D'!AC34","v":"VfL \"Fortuna\" Veenhusen 2"},"__:__"]
["Platz","Gruppe","Anstoss","Mannschaft 1","Mannschaft 2","Ergebnis"]
[4,"A",{"$f":"'VR Gruppe D'!D35","v":"17:58:00"},{"$f":"'VR Gruppe D'!I35","v":"TuS Strudden 2"},{"$f":"'VR Gruppe D'!AC35","v":"TSV Barrien"},"__:__"]

{"sheet":"Lauf VRGE","index":20,"n_rows":31,"n_cols":6,"rows_kept":31,"cut":false,"hidden":false,"merged":[]}
["Platz","Gruppe","Anstoss","Mannschaft 1","Mannschaft 2","Ergebnis"]
[{"$f":"'VR Gruppeneinteilung'!C21","v":5},"A",{"$f":"'VR Gruppe E'!D21","v":"14:00:00"},{"$f":"'VR Gruppe E'!I21","v":"Weiße Elf Nordhorn"},{"$f":"'VR Gruppe E'!AC21","v":"SV Wallinghausen"},"__:__"]
["Platz","Gruppe","Anstoss","Mannschaft 1","Mannschaft 2","Ergebnis"]
[{"$f":"$A$2","v":5},{"$f":"$B$2","v":"A"},{"$f":"'VR Gruppe E'!D22","v":"14:17:00"},{"$f":"'VR Gruppe E'!I22","v":"SF Oesede"},{"$f":"'VR Gruppe E'!AC22","v":"SV Spetzerfehn"},"__:__"]
["Platz","Gruppe","Anstoss","Mannschaft 1","Mannschaft 2","Ergebnis"]
[{"$f":"$A$2","v":5},{"$f":"$B$2","v":"A"},{"$f":"'VR Gruppe E'!D23","v":"14:34:00"},{"$f":"'VR Gruppe E'!I23","v":"SV Concordia Neermoor"},{"$f":"'VR Gruppe E'!AC23","v":"TV Apen"},"__:__"]
["Platz","Gruppe","Anstoss","Mannschaft 1","Mannschaft 2","Ergebnis"]
[{"$f":"$A$2","v":5},"A",{"$f":"'VR Gruppe E'!D24","v":"14:51:00"},{"$f":"'VR Gruppe E'!I24","v":"Weiße Elf Nordhorn"},{"$f":"'VR Gruppe E'!AC24","v":"SF Oesede"},"__:__"]
["Platz","Gruppe","Anstoss","Mannschaft 1","Mannschaft 2","Ergebnis"]
[{"$f":"$A$2","v":5},"A",{"$f":"'VR Gruppe E'!D25","v":"15:08:00"},{"$f":"'VR Gruppe E'!I25","v":"SV Wallinghausen"},{"$f":"'VR Gruppe E'!AC25","v":"SV Concordia Neermoor"},"__:__"]
["Platz","Gruppe","Anstoss","Mannschaft 1","Mannschaft 2","Ergebnis"]
[{"$f":"$A$2","v":5},"A",{"$f":"'VR Gruppe E'!D26","v":"15:25:00"},{"$f":"'VR Gruppe E'!I26","v":"SV Spetzerfehn"},{"$f":"'VR Gruppe E'!AC26","v":"TV Apen"},"__:__"]
["Platz","Gruppe","Anstoss","Mannschaft 1","Mannschaft 2","Ergebnis"]
[{"$f":"$A$2","v":5},"A",{"$f":"'VR Gruppe E'!D27","v":"15:42:00"},{"$f":"'VR Gruppe E'!I27","v":"SV Concordia Neermoor"},{"$f":"'VR Gruppe E'!AC27","v":"Weiße Elf Nordhorn"},"__:__"]
["Platz","Gruppe","Anstoss","Mannschaft 1","Mannschaft 2","Ergebnis"]
[{"$f":"$A$2","v":5},"A",{"$f":"'VR Gruppe E'!D28","v":"15:59:00"},{"$f":"'VR Gruppe E'!I28","v":"SV Wallinghausen"},{"$f":"'VR Gruppe E'!AC28","v":"SV Spetzerfehn"},"__:__"]
[]
["Platz","Gruppe","Anstoss","Mannschaft 1","Mannschaft 2","Ergebnis"]
[{"$f":"$A$2","v":5},"A",{"$f":"'VR Gruppe E'!D29","v":"16:16:00"},{"$f":"'VR Gruppe E'!I29","v":"TV Apen"},{"$f":"'VR Gruppe E'!AC29","v":"SF Oesede"},"__:__"]
["Platz","Gruppe","Anstoss","Mannschaft 1","Mannschaft 2","Ergebnis"]
[{"$f":"$A$2","v":5},"A",{"$f":"'VR Gruppe E'!D30","v":"16:33:00"},{"$f":"'VR Gruppe E'!I30","v":"Weiße Elf Nordhorn"},{"$f":"'VR Gruppe E'!AC30","v":"SV Spetzerfehn"},"__:__"]
["Platz","Gruppe","Anstoss","Mannschaft 1","Mannschaft 2","Ergebnis"]
[{"$f":"$A$2","v":5},"A",{"$f":"'VR Gruppe E'!D31","v":"16:50:00"},{"$f":"'VR Gruppe E'!I31","v":"TV Apen"},{"$f":"'VR Gruppe E'!AC31","v":"SV Wallinghausen"},"__:__"]
["Platz","Gruppe","Anstoss","Mannschaft 1","Mannschaft 2","Ergebnis"]
[5,"A",{"$f":"'VR Gruppe E'!D32","v":"17:07:00"},{"$f":"'VR Gruppe E'!I32","v":"SF Oesede"},{"$f":"'VR Gruppe E'!AC32","v":"SV Concordia Neermoor"},"__:__"]
["Platz","Gruppe","Anstoss","Mannschaft 1","Mannschaft 2","Ergebnis"]
[5,"A",{"$f":"'VR Gruppe E'!D33","v":"17:24:00"},{"$f":"'VR Gruppe E'!I33","v":"TV Apen"},{"$f":"'VR Gruppe E'!AC33","v":"Weiße Elf Nordhorn"},"__:__"]
["Platz","Gruppe","Anstoss","Mannschaft 1","Mannschaft 2","Ergebnis"]
[5,"A",{"$f":"'VR Gruppe E'!D34","v":"17:41:00"},{"$f":"'VR Gruppe E'!I34","v":"SV Wallinghausen"},{"$f":"'VR Gruppe E'!AC34","v":"SF Oesede"},"__:__"]
["Platz","Gruppe","Anstoss","Mannschaft 1","Mannschaft 2","Ergebnis"]
[5,"A",{"$f":"'VR Gruppe E'!D35","v":"17:58:00"},{"$f":"'VR Gruppe E'!I35","v":"SV Spetzerfehn"},{"$f":"'VR Gruppe E'!AC35","v":"SV Concordia Neermoor"},"__:__"]

{"sheet":"Lauf ZR1","index":21,"n_rows":21,"n_cols":6,"rows_kept":21,"cut":false,"hidden":false,"merged":[]}
["Platz","Gruppe","Anstoss","Mannschaft 1","Mannschaft 2","Ergebnis"]
[{"$f":"'ZR Gruppe A'!D20","v":1},"ZR1",{"$f":"'ZR Gruppe A'!J20","v":"10:00:00"},{"$f":"'ZR Gruppe A'!O20","v":"BW Papenburg"},{"$f":"'ZR Gruppe A'!AF20","v":"VfL Viktoria Flachsmeer"},"__:__"]
["Platz","Gruppe","Anstoss","Mannschaft 1","Mannschaft 2","Ergebnis"]
[{"$f":"'ZR Gruppe A'!D21","v":1},{"$f":"B2","v":"ZR1"},{"$f":"'ZR Gruppe A'!J21","v":"10:14:00"},{"$f":"'ZR Gruppe A'!O21","v":"TV Jahn Delmenhorst"},{"$f":"'ZR Gruppe A'!AF21","v":"VfL \"Fortuna\" Veenhusen 1"},"__:__"]
["Platz","Gruppe","Anstoss","Mannschaft 1","Mannschaft 2","Ergebnis"]
[{"$f":"'ZR Gruppe A'!D22","v":1},{"$f":"B4","v":"ZR1"},{"$f":"'ZR Gruppe A'!J22","v":"10:28:00"},{"$f":"'ZR Gruppe A'!O22","v":"Weiße Elf Nordhorn"},{"$f":"'ZR Gruppe A'!AF22","v":"BW Papenburg"},"__:__"]
["Platz","Gruppe","Anstoss","Mannschaft 1","Mannschaft 2","Ergebnis"]
[{"$f":"'ZR Gruppe A'!D23","v":1},{"$f":"B6","v":"ZR1"},{"$f":"'ZR Gruppe A'!J23","v":"10:42:00"},{"$f":"'ZR Gruppe A'!O23","v":"VfL Viktoria Flachsmeer"},{"$f":"'ZR Gruppe A'!AF23","v":"TV Jahn Delmenhorst"},"__:__"]
["Platz","Gruppe","Anstoss","Mannschaft 1","Mannschaft 2","Ergebnis"]
[{"$f":"'ZR Gruppe A'!D24","v":1},{"$f":"B8","v":"ZR1"},{"$f":"'ZR Gruppe A'!J24","v":"10:56:00"},{"$f":"'ZR Gruppe A'!O24","v":"VfL \"Fortuna\" Veenhusen 1"},{"$f":"'ZR Gruppe A'!AF24","v":"Weiße Elf Nordhorn"},"__:__"]
["Platz","Gruppe","Anstoss","Mannschaft 1","Mannschaft 2","Ergebnis"]
[{"$f":"'ZR Gruppe A'!D25","v":1},{"$f":"B10","v":"ZR1"},{"$f":"'ZR Gruppe A'!J25","v":"11:10:00"},{"$f":"'ZR Gruppe A'!O25","v":"BW Papenburg"},{"$f":"'ZR Gruppe A'!AF25","v":"TV Jahn Delmenhorst"},"__:__"]
["Platz","Gruppe","Anstoss","Mannschaft 1","Mannschaft 2","Ergebnis"]
[{"$f":"'ZR Gruppe A'!D26","v":1},{"$f":"B12","v":"ZR1"},{"$f":"'ZR Gruppe A'!J26","v":"11:24:00"},{"$f":"'ZR Gruppe A'!O26","v":"VfL Viktoria Flachsmeer"},{"$f":"'ZR Gruppe A'!AF26","v":"VfL \"Fortuna\" Veenhusen 1"},"__:__"]
["Platz","Gruppe","Anstoss","Mannschaft 1","Mannschaft 2","Ergebnis"]
[{"$f":"'ZR Gruppe A'!D27","v":1},{"$f":"B14","v":"ZR1"},{"$f":"'ZR Gruppe A'!J27","v":"12:30:00"},{"$f":"'ZR Gruppe A'!O27","v":"TV Jahn Delmenhorst"},{"$f":"'ZR Gruppe A'!AF27","v":"Weiße Elf Nordhorn"},"__:__"]
[]
["Platz","Gruppe","Anstoss","Mannschaft 1","Mannschaft 2","Ergebnis"]
[{"$f":"'ZR Gruppe A'!D28","v":1},{"$f":"B16","v":"ZR1"},{"$f":"'ZR Gruppe A'!J28","v":"12:44:00"},{"$f":"'ZR Gruppe A'!O28","v":"VfL \"Fortuna\" Veenhusen 1"},{"$f":"'ZR Gruppe A'!AF28","v":"BW Papenburg"},"__:__"]
["Platz","Gruppe","Anstoss","Mannschaft 1","Mannschaft 2","Ergebnis"]
[{"$f":"'ZR Gruppe A'!D29","v":1},{"$f":"B19","v":"ZR1"},{"$f":"'ZR Gruppe A'!J29","v":"12:58:00"},{"$f":"'ZR Gruppe A'!O29","v":"Weiße Elf Nordhorn"},{"$f":"'ZR Gruppe A'!AF29","v":"VfL Viktoria Flachsmeer"},"__:__"]

{"sheet":"Lauf ZR2","index":22,"n_rows":21,"n_cols":6,"rows_kept":21,"cut":false,"hidden":false,"merged":[]}
["Platz","Gruppe","Anstoss","Mannschaft 1","Mannschaft 2","Ergebnis"]
[{"$f":"'ZR Gruppe B'!D20","v":1},"ZR2",{"$f":"'ZR Gruppe B'!J20","v":"10:00:00"},{"$f":"'ZR Gruppe B'!O20","v":"JSG Riede/Emtinghausen 1"},{"$f":"'ZR Gruppe B'!AF20","v":"Frisia Loga"},"__:__"]
["Platz","Gruppe","Anstoss","Mannschaft 1","Mannschaft 2","Ergebnis"]
[{"$f":"'ZR Gruppe B'!D21","v":1},{"$f":"B2","v":"ZR2"},{"$f":"'ZR Gruppe B'!J21","v":"10:14:00"},{"$f":"'ZR Gruppe B'!O21","v":"VfL Germania Leer"},{"$f":"'ZR Gruppe B'!AF21","v":"TSV Barrien"},"__:__"]
["Platz","Gruppe","Anstoss","Mannschaft 1","Mannschaft 2","Ergebnis"]
[{"$f":"'ZR Gruppe B'!D22","v":1},{"$f":"B4","v":"ZR2"},{"$f":"'ZR Gruppe B'!J22","v":"10:28:00"},{"$f":"'ZR Gruppe B'!O22","v":"SF Oesede"},{"$f":"'ZR Gruppe B'!AF22","v":"JSG Riede/Emtinghausen 1"},"__:__"]
["Platz","Gruppe","Anstoss","Mannschaft 1","Mannschaft 2","Ergebnis"]
[{"$f":"'ZR Gruppe B'!D23","v":1},{"$f":"B6","v":"ZR2"},{"$f":"'ZR Gruppe B'!J23","v":"10:42:00"},{"$f":"'ZR Gruppe B'!O23","v":"Frisia Loga"},{"$f":"'ZR Gruppe B'!AF23","v":"VfL Germania Leer"},"__:__"]
["Platz","Gruppe","Anstoss","Mannschaft 1","Mannschaft 2","Ergebnis"]
[{"$f":"'ZR Gruppe B'!D24","v":1},{"$f":"B8","v":"ZR2"},{"$f":"'ZR Gruppe B'!J24","v":"10:56:00"},{"$f":"'ZR Gruppe B'!O24","v":"TSV Barrien"},{"$f":"'ZR Gruppe B'!AF24","v":"SF Oesede"},"__:__"]
["Platz","Gruppe","Anstoss","Mannschaft 1","Mannschaft 2","Ergebnis"]
[{"$f":"'ZR Gruppe B'!D25","v":1},{"$f":"B10","v":"ZR2"},{"$f":"'ZR Gruppe B'!J25","v":"11:10:00"},{"$f":"'ZR Gruppe B'!O25","v":"JSG Riede/Emtinghausen 1"},{"$f":"'ZR Gruppe B'!AF25","v":"VfL Germania Leer"},"__:__"]
["Platz","Gruppe","Anstoss","Mannschaft 1","Mannschaft 2","Ergebnis"]
[{"$f":"'ZR Gruppe B'!D26","v":1},{"$f":"B12","v":"ZR2"},{"$f":"'ZR Gruppe B'!J26","v":"11:24:00"},{"$f":"'ZR Gruppe B'!O26","v":"Frisia Loga"},{"$f":"'ZR Gruppe B'!AF26","v":"TSV Barrien"},"__:__"]
["Platz","Gruppe","Anstoss","Mannschaft 1","Mannschaft 2","Ergebnis"]
[{"$f":"'ZR Gruppe B'!D27","v":1},{"$f":"B14","v":"ZR2"},{"$f":"'ZR Gruppe B'!J27","v":"12:30:00"},{"$f":"'ZR Gruppe B'!O27","v":"VfL Germania Leer"},{"$f":"'ZR Gruppe B'!AF27","v":"SF Oesede"},"__:__"]
[]
["Platz","Gruppe","Anstoss","Mannschaft 1","Mannschaft 2","Ergebnis"]
[{"$f":"'ZR Gruppe B'!D28","v":1},{"$f":"B16","v":"ZR2"},{"$f":"'ZR Gruppe B'!J28","v":"12:44:00"},{"$f":"'ZR Gruppe B'!O28","v":"TSV Barrien"},{"$f":"'ZR Gruppe B'!AF28","v":"JSG Riede/Emtinghausen 1"},"__:__"]
["Platz","Gruppe","Anstoss","Mannschaft 1","Mannschaft 2","Ergebnis"]
[{"$f":"'ZR Gruppe B'!D29","v":1},{"$f":"B19","v":"ZR2"},{"$f":"'ZR Gruppe B'!J29","v":"12:58:00"},{"$f":"'ZR Gruppe B'!O29","v":"SF Oesede"},{"$f":"'ZR Gruppe B'!AF29","v":"Frisia Loga"},"__:__"]

{"sheet":"Lauf Endrunde","index":23,"n_rows":10,"n_cols":6,"rows_kept":10,"cut":false,"hidden":false,"merged":[]}
["Platz","Gruppe","Anstoss","Mannschaft 1","Mannschaft 2","Ergebnis"]
[{"$f":"Endrunde!C4","v":3},"PL9",{"$f":"Endrunde!D4","v":"13:30:00"},{"$f":"Endrunde!E4","v":"VfL Viktoria Flachsmeer"},{"$f":"Endrunde!G4","v":"Frisia Loga"},"__:__"]
["Platz","Gruppe","Anstoss","Mannschaft 1","Mannschaft 2","Ergebnis"]
[{"$f":"Endrunde!C8","v":2},"PL7",{"$f":"Endrunde!D8","v":"13:30:00"},{"$f":"Endrunde!E8","v":"VfL \"Fortuna\" Veenhusen 1"},{"$f":"Endrunde!G8","v":"TSV Barrien"},"__:__"]
["Platz","Gruppe","Anstoss","Mannschaft 1","Mannschaft 2","Ergebnis"]
[{"$f":"Endrunde!C12","v":1},"Pl5",{"$f":"Endrunde!D12","v":"13:30:00"},{"$f":"Endrunde!E12","v":"TV Jahn Delmenhorst"},{"$f":"Endrunde!G12","v":"VfL Germania Leer"},"__:__"]
["Platz","Gruppe","Anstoss","Mannschaft 1","Mannschaft 2","Ergebnis"]
[{"$f":"Endrunde!C16","v":1},"Pl3",{"$f":"Endrunde!D16","v":"14:00:00"},{"$f":"Endrunde!E16","v":"BW Papenburg"},{"$f":"Endrunde!G16","v":"SF Oesede"},"__:__"]
["Platz","Gruppe","Anstoss","Mannschaft 1","Mannschaft 2","Ergebnis"]
[{"$f":"Endrunde!C20","v":1},"Finale",{"$f":"Endrunde!D20","v":"14:30:00"},{"$f":"Endrunde!E20","v":"Weiße Elf Nordhorn"},{"$f":"Endrunde!G20","v":"JSG Riede/Emtinghausen 1"},"__:__"]

{"sheet":"Lauf11-15","index":24,"n_rows":21,"n_cols":6,"rows_kept":21,"cut":false,"hidden":false,"merged":[]}
["Platz","Gruppe","Anstoss","Mannschaft 1","Mannschaft 2","Ergebnis"]
[{"$f":"'11 - 15'!D20","v":3},"11 - 15",{"$f":"'11 - 15'!J20","v":"10:00:00"},{"$f":"'11 - 15'!O20","v":"JSG Kloster Oesede/Harderberg"},{"$f":"'11 - 15'!AF20","v":"FSV Westerstede"},"__:__"]
["Platz","Gruppe","Anstoss","Mannschaft 1","Mannschaft 2","Ergebnis"]
[{"$f":"'11 - 15'!D21","v":3},"11 - 15",{"$f":"'11 - 15'!J21","v":"10:14:00"},{"$f":"'11 - 15'!O21","v":"TuS Strudden 1"},{"$f":"'11 - 15'!AF21","v":"SV Großefehn"},"__:__"]
["Platz","Gruppe","Anstoss","Mannschaft 1","Mannschaft 2","Ergebnis"]
[{"$f":"'11 - 15'!D22","v":3},"11 - 15",{"$f":"'11 - 15'!J22","v":"10:28:00"},{"$f":"'11 - 15'!O22","v":"TV Apen"},{"$f":"'11 - 15'!AF22","v":"JSG Kloster Oesede/Harderberg"},"__:__"]
["Platz","Gruppe","Anstoss","Mannschaft 1","Mannschaft 2","Ergebnis"]
[{"$f":"'11 - 15'!D23","v":3},"11 - 15",{"$f":"'11 - 15'!J23","v":"10:42:00"},{"$f":"'11 - 15'!O23","v":"FSV Westerstede"},{"$f":"'11 - 15'!AF23","v":"TuS Strudden 1"},"__:__"]
["Platz","Gruppe","Anstoss","Mannschaft 1","Mannschaft 2","Ergebnis"]
[{"$f":"'11 - 15'!D24","v":3},"11 - 15",{"$f":"'11 - 15'!J24","v":"10:56:00"},{"$f":"'11 - 15'!O24","v":"SV Großefehn"},{"$f":"'11 - 15'!AF24","v":"TV Apen"},"__:__"]
["Platz","Gruppe","Anstoss","Mannschaft 1","Mannschaft 2","Ergebnis"]
[{"$f":"'11 - 15'!D25","v":3},"11 - 15",{"$f":"'11 - 15'!J25","v":"11:10:00"},{"$f":"'11 - 15'!O25","v":"JSG Kloster Oesede/Harderberg"},{"$f":"'11 - 15'!AF25","v":"TuS Strudden 1"},"__:__"]
["Platz","Gruppe","Anstoss","Mannschaft 1","Mannschaft 2","Ergebnis"]
[{"$f":"'11 - 15'!D26","v":3},"11 - 15",{"$f":"'11 - 15'!J26","v":"11:24:00"},{"$f":"'11 - 15'!O26","v":"FSV Westerstede"},{"$f":"'11 - 15'!AF26","v":"SV Großefehn"},"__:__"]
["Platz","Gruppe","Anstoss","Mannschaft 1","Mannschaft 2","Ergebnis"]
[{"$f":"'11 - 15'!D27","v":3},"11 - 15",{"$f":"'11 - 15'!J27","v":"12:30:00"},{"$f":"'11 - 15'!O27","v":"TuS Strudden 1"},{"$f":"'11 - 15'!AF27","v":"TV Apen"},"__:__"]
[]
["Platz","Gruppe","Anstoss","Mannschaft 1","Mannschaft 2","Ergebnis"]
[{"$f":"'11 - 15'!D28","v":3},"11 - 15",{"$f":"'11 - 15'!J28","v":"12:44:00"},{"$f":"'11 - 15'!O28","v":"SV Großefehn"},{"$f":"'11 - 15'!AF28","v":"JSG Kloster Oesede/Harderberg"},"__:__"]
["Platz","Gruppe","Anstoss","Mannschaft 1","Mannschaft 2","Ergebnis"]
[{"$f":"'11 - 15'!D29","v":3},"11 - 15",{"$f":"'11 - 15'!J29","v":"12:58:00"},{"$f":"'11 - 15'!O29","v":"TV Apen"},{"$f":"'11 - 15'!AF29","v":"FSV Westerstede"},"__:__"]

{"sheet":"Lauf16-20","index":25,"n_rows":21,"n_cols":6,"rows_kept":21,"cut":false,"hidden":false,"merged":[]}
["Platz","Gruppe","Anstoss","Mannschaft 1","Mannschaft 2","Ergebnis"]
[{"$f":"'16 - 20'!D20","v":4},"16 - 20",{"$f":"'16 - 20'!J20","v":"10:00:00"},{"$f":"'16 - 20'!O20","v":"TuS Eversten E5"},{"$f":"'16 - 20'!AF20","v":"TuS  Hasbergen"},"__:__"]
["Platz","Gruppe","Anstoss","Mannschaft 1","Mannschaft 2","Ergebnis"]
[{"$f":"'16 - 20'!D21","v":4},"16 - 20",{"$f":"'16 - 20'!J21","v":"10:14:00"},{"$f":"'16 - 20'!O21","v":"JSG Riede/Emtinghausen 2"},{"$f":"'16 - 20'!AF21","v":"TuS Strudden 2"},"__:__"]
["Platz","Gruppe","Anstoss","Mannschaft 1","Mannschaft 2","Ergebnis"]
[{"$f":"'16 - 20'!D22","v":4},"16 - 20",{"$f":"'16 - 20'!J22","v":"10:28:00"},{"$f":"'16 - 20'!O22","v":"SV Spetzerfehn"},{"$f":"'16 - 20'!AF22","v":"TuS Eversten E5"},"__:__"]
["Platz","Gruppe","Anstoss","Mannschaft 1","Mannschaft 2","Ergebnis"]
[{"$f":"'16 - 20'!D23","v":4},"16 - 20",{"$f":"'16 - 20'!J23","v":"10:42:00"},{"$f":"'16 - 20'!O23","v":"TuS  Hasbergen"},{"$f":"'16 - 20'!AF23","v":"JSG Riede/Emtinghausen 2"},"__:__"]
["Platz","Gruppe","Anstoss","Mannschaft 1","Mannschaft 2","Ergebnis"]
[{"$f":"'16 - 20'!D24","v":4},"16 - 20",{"$f":"'16 - 20'!J24","v":"10:56:00"},{"$f":"'16 - 20'!O24","v":"TuS Strudden 2"},{"$f":"'16 - 20'!AF24","v":"SV Spetzerfehn"},"__:__"]
["Platz","Gruppe","Anstoss","Mannschaft 1","Mannschaft 2","Ergebnis"]
[{"$f":"'16 - 20'!D25","v":4},"16 - 20",{"$f":"'16 - 20'!J25","v":"11:10:00"},{"$f":"'16 - 20'!O25","v":"TuS Eversten E5"},{"$f":"'16 - 20'!AF25","v":"JSG Riede/Emtinghausen 2"},"__:__"]
["Platz","Gruppe","Anstoss","Mannschaft 1","Mannschaft 2","Ergebnis"]
[{"$f":"'16 - 20'!D26","v":4},"16 - 20",{"$f":"'16 - 20'!J26","v":"11:24:00"},{"$f":"'16 - 20'!O26","v":"TuS  Hasbergen"},{"$f":"'16 - 20'!AF26","v":"TuS Strudden 2"},"__:__"]
["Platz","Gruppe","Anstoss","Mannschaft 1","Mannschaft 2","Ergebnis"]
[{"$f":"'16 - 20'!D27","v":4},"16 - 20",{"$f":"'16 - 20'!J27","v":"12:30:00"},{"$f":"'16 - 20'!O27","v":"JSG Riede/Emtinghausen 2"},{"$f":"'16 - 20'!AF27","v":"SV Spetzerfehn"},"__:__"]
[]
["Platz","Gruppe","Anstoss","Mannschaft 1","Mannschaft 2","Ergebnis"]
[{"$f":"'16 - 20'!D28","v":4},"16 - 20",{"$f":"'16 - 20'!J28","v":"12:44:00"},{"$f":"'16 - 20'!O28","v":"TuS Strudden 2"},{"$f":"'16 - 20'!AF28","v":"TuS Eversten E5"},"__:__"]
["Platz","Gruppe","Anstoss","Mannschaft 1","Mannschaft 2","Ergebnis"]
[{"$f":"'16 - 20'!D29","v":4},"16 - 20",{"$f":"'16 - 20'!J29","v":"12:58:00"},{"$f":"'16 - 20'!O29","v":"SV Spetzerfehn"},{"$f":"'16 - 20'!AF29","v":"TuS  Hasbergen"},"__:__"]

{"sheet":"Lauf21-25","index":26,"n_rows":21,"n_cols":6,"rows_kept":21,"cut":false,"hidden":false,"merged":[]}
["Platz","Gruppe","Anstoss","Mannschaft 1","Mannschaft 2","Ergebnis"]
[{"$f":"'21 -25'!D20","v":5},"21 -25",{"$f":"'21 -25'!J20","v":"10:00:00"},{"$f":"'21 -25'!O20","v":"Borussia Salchendorf"},{"$f":"'21 -25'!AF20","v":"SV Warsingsfehn 3"},"__:__"]
["Platz","Gruppe","Anstoss","Mannschaft 1","Mannschaft 2","Ergebnis"]
[{"$f":"'21 -25'!D21","v":5},"21 -25",{"$f":"'21 -25'!J21","v":"10:14:00"},{"$f":"'21 -25'!O21","v":"TuS Holthusen"},{"$f":"'21 -25'!AF21","v":"TuS Weener"},"__:__"]
["Platz","Gruppe","Anstoss","Mannschaft 1","Mannschaft 2","Ergebnis"]
[{"$f":"'21 -25'!D22","v":5},"21 -25",{"$f":"'21 -25'!J22","v":"10:28:00"},{"$f":"'21 -25'!O22","v":"SV Wallinghausen"},{"$f":"'21 -25'!AF22","v":"Borussia Salchendorf"},"__:__"]
["Platz","Gruppe","Anstoss","Mannschaft 1","Mannschaft 2","Ergebnis"]
[{"$f":"'21 -25'!D23","v":5},"21 -25",{"$f":"'21 -25'!J23","v":"10:42:00"},{"$f":"'21 -25'!O23","v":"SV Warsingsfehn 3"},{"$f":"'21 -25'!AF23","v":"TuS Holthusen"},"__:__"]
["Platz","Gruppe","Anstoss","Mannschaft 1","Mannschaft 2","Ergebnis"]
[{"$f":"'21 -25'!D24","v":5},"21 -25",{"$f":"'21 -25'!J24","v":"10:56:00"},{"$f":"'21 -25'!O24","v":"TuS Weener"},{"$f":"'21 -25'!AF24","v":"SV Wallinghausen"},"__:__"]
["Platz","Gruppe","Anstoss","Mannschaft 1","Mannschaft 2","Ergebnis"]
[{"$f":"'21 -25'!D25","v":5},"21 -25",{"$f":"'21 -25'!J25","v":"11:10:00"},{"$f":"'21 -25'!O25","v":"Borussia Salchendorf"},{"$f":"'21 -25'!AF25","v":"TuS Holthusen"},"__:__"]
["Platz","Gruppe","Anstoss","Mannschaft 1","Mannschaft 2","Ergebnis"]
[{"$f":"'21 -25'!D26","v":5},"21 -25",{"$f":"'21 -25'!J26","v":"11:24:00"},{"$f":"'21 -25'!O26","v":"SV Warsingsfehn 3"},{"$f":"'21 -25'!AF26","v":"TuS Weener"},"__:__"]
["Platz","Gruppe","Anstoss","Mannschaft 1","Mannschaft 2","Ergebnis"]
[{"$f":"'21 -25'!D27","v":5},"21 -25",{"$f":"'21 -25'!J27","v":"12:30:00"},{"$f":"'21 -25'!O27","v":"TuS Holthusen"},{"$f":"'21 -25'!AF27","v":"SV Wallinghausen"},"__:__"]
[]
["Platz","Gruppe","Anstoss","Mannschaft 1","Mannschaft 2","Ergebnis"]
[{"$f":"'21 -25'!D28","v":5},"21 -25",{"$f":"'21 -25'!J28","v":"12:44:00"},{"$f":"'21 -25'!O28","v":"TuS Weener"},{"$f":"'21 -25'!AF28","v":"Borussia Salchendorf"},"__:__"]
["Platz","Gruppe","Anstoss","Mannschaft 1","Mannschaft 2","Ergebnis"]
[{"$f":"'21 -25'!D29","v":5},"21 -25",{"$f":"'21 -25'!J29","v":"12:58:00"},{"$f":"'21 -25'!O29","v":"SV Wallinghausen"},{"$f":"'21 -25'!AF29","v":"SV Warsingsfehn 3"},"__:__"]

{"sheet":"Lauf26 -30","index":27,"n_rows":21,"n_cols":6,"rows_kept":21,"cut":false,"hidden":false,"merged":[]}
["Platz","Gruppe","Anstoss","Mannschaft 1","Mannschaft 2","Ergebnis"]
[{"$f":"'26 -30'!D20","v":6},"26 -30",{"$f":"'26 -30'!J20","v":"10:00:00"},{"$f":"'26 -30'!O20","v":"VfL \"Fortuna\" Veenhusen 3"},{"$f":"'26 -30'!AF20","v":"\"Fortuna\" Veenhusen E-Mädchen"},"__:__"]
["Platz","Gruppe","Anstoss","Mannschaft 1","Mannschaft 2","Ergebnis"]
[{"$f":"'26 -30'!D21","v":6},"26 -30",{"$f":"'26 -30'!J21","v":"10:14:00"},{"$f":"'26 -30'!O21","v":"BW Galgenmoor"},{"$f":"'26 -30'!AF21","v":"VfL \"Fortuna\" Veenhusen 2"},"__:__"]
["Platz","Gruppe","Anstoss","Mannschaft 1","Mannschaft 2","Ergebnis"]
[{"$f":"'26 -30'!D22","v":6},"26 -30",{"$f":"'26 -30'!J22","v":"10:28:00"},{"$f":"'26 -30'!O22","v":"SV Concordia Neermoor"},{"$f":"'26 -30'!AF22","v":"VfL \"Fortuna\" Veenhusen 3"},"__:__"]
["Platz","Gruppe","Anstoss","Mannschaft 1","Mannschaft 2","Ergebnis"]
[{"$f":"'26 -30'!D23","v":6},"26 -30",{"$f":"'26 -30'!J23","v":"10:42:00"},{"$f":"'26 -30'!O23","v":"\"Fortuna\" Veenhusen E-Mädchen"},{"$f":"'26 -30'!AF23","v":"BW Galgenmoor"},"__:__"]
["Platz","Gruppe","Anstoss","Mannschaft 1","Mannschaft 2","Ergebnis"]
[{"$f":"'26 -30'!D24","v":6},"26 -30",{"$f":"'26 -30'!J24","v":"10:56:00"},{"$f":"'26 -30'!O24","v":"VfL \"Fortuna\" Veenhusen 2"},{"$f":"'26 -30'!AF24","v":"SV Concordia Neermoor"},"__:__"]
["Platz","Gruppe","Anstoss","Mannschaft 1","Mannschaft 2","Ergebnis"]
[{"$f":"'26 -30'!D25","v":6},"26 -30",{"$f":"'26 -30'!J25","v":"11:10:00"},{"$f":"'26 -30'!O25","v":"VfL \"Fortuna\" Veenhusen 3"},{"$f":"'26 -30'!AF25","v":"BW Galgenmoor"},"__:__"]
["Platz","Gruppe","Anstoss","Mannschaft 1","Mannschaft 2","Ergebnis"]
[{"$f":"'26 -30'!D26","v":6},"26 -30",{"$f":"'26 -30'!J26","v":"11:24:00"},{"$f":"'26 -30'!O26","v":"\"Fortuna\" Veenhusen E-Mädchen"},{"$f":"'26 -30'!AF26","v":"VfL \"Fortuna\" Veenhusen 2"},"__:__"]
["Platz","Gruppe","Anstoss","Mannschaft 1","Mannschaft 2","Ergebnis"]
[{"$f":"'26 -30'!D27","v":6},"26 -30",{"$f":"'26 -30'!J27","v":"12:30:00"},{"$f":"'26 -30'!O27","v":"BW Galgenmoor"},{"$f":"'26 -30'!AF27","v":"SV Concordia Neermoor"},"__:__"]
[]
["Platz","Gruppe","Anstoss","Mannschaft 1","Mannschaft 2","Ergebnis"]
[{"$f":"'26 -30'!D28","v":6},"26 -30",{"$f":"'26 -30'!J28","v":"12:44:00"},{"$f":"'26 -30'!O28","v":"VfL \"Fortuna\" Veenhusen 2"},{"$f":"'26 -30'!AF28","v":"VfL \"Fortuna\" Veenhusen 3"},"__:__"]
["Platz","Gruppe","Anstoss","Mannschaft 1","Mannschaft 2","Ergebnis"]
[{"$f":"'26 -30'!D29","v":6},"26 -30",{"$f":"'26 -30'!J29","v":"12:58:00"},{"$f":"'26 -30'!O29","v":"SV Concordia Neermoor"},{"$f":"'26 -30'!AF29","v":"\"Fortuna\" Veenhusen E-Mädchen"},"__:__"]

{"sheet":"Elfmeter","index":28,"n_rows":33,"n_cols":11,"rows_kept":33,"cut":false,"hidden":false,"merged":[[0,1,1,1],[0,0,1,0],[0,2,0,10]]}
["Verein","Schütze","Schuss"]
[null,null,1,2,3,4,5,6,7,8,9]
[{"$f":"'VR Gruppeneinteilung'!H2","v":"BW Papenburg"},"Malte Schendzielorz"]
[{"$f":"'VR Gruppeneinteilung'!H3","v":"TuS Eversten E5"},"Matti Püschel"]
[{"$f":"'VR Gruppeneinteilung'!H4","v":"Borussia Salchendorf"},"Valentin Steinbaron"]
[{"$f":"'VR Gruppeneinteilung'!H5","v":"VfL Viktoria Flachsmeer"},"Jonas Voskamp"]
[{"$f":"'VR Gruppeneinteilung'!H6","v":"VfL \"Fortuna\" Veenhusen 3"},"Jannes Stock"]
[{"$f":"'VR Gruppeneinteilung'!H7","v":"JSG Kloster Oesede/Harderberg"},"Michael Többen"]
[{"$f":"'VR Gruppeneinteilung'!H8","v":"Frisia Loga"},"Joss Luca Diepetz"]
[{"$f":"'VR Gruppeneinteilung'!H9","v":"\"Fortuna\" Veenhusen E-Mädchen"},"Anna Rosenboom"]
[{"$f":"'VR Gruppeneinteilung'!H10","v":"TuS  Hasbergen"},"Enrico Köhler"]
[{"$f":"'VR Gruppeneinteilung'!H11","v":"FSV Westerstede"},"Matti Hobbiebrunken"]
[{"$f":"'VR Gruppeneinteilung'!H12","v":"JSG Riede/Emtinghausen 1"},"Luca Bormann"]
[{"$f":"'VR Gruppeneinteilung'!H13","v":"SV Warsingsfehn 3"},"Thore Sochmierda"]
[{"$f":"'VR Gruppeneinteilung'!H14","v":"VfL \"Fortuna\" Veenhusen 1"},"Wilke Ammermann"]
[{"$f":"'VR Gruppeneinteilung'!H15","v":"TV Jahn Delmenhorst"},"Kaan Er"]
[{"$f":"'VR Gruppeneinteilung'!H16","v":"JSG Riede/Emtinghausen 2"},"Hanke Kehlenbek"]
[{"$f":"'VR Gruppeneinteilung'!H17","v":"TuS Holthusen"},"Klaas Riehmeyer"]
[{"$f":"'VR Gruppeneinteilung'!H18","v":"TuS Strudden 1"},"Kevin Tobiassen"]
[{"$f":"'VR Gruppeneinteilung'!H19","v":"BW Galgenmoor"},"Michael Dinklage"]
[{"$f":"'VR Gruppeneinteilung'!H20","v":"VfL Germania Leer"},"Aron Müseler"]
[{"$f":"'VR Gruppeneinteilung'!H21","v":"SV Großefehn"},"Leon Schmäding"]
[{"$f":"'VR Gruppeneinteilung'!H22","v":"VfL \"Fortuna\" Veenhusen 2"},"Manuel Hanschke"]
[{"$f":"'VR Gruppeneinteilung'!H23","v":"TuS Strudden 2"},"Tobias Leerhoff"]
[{"$f":"'VR Gruppeneinteilung'!H24","v":"TSV Barrien"},"Elario Ghassan"]
[{"$f":"'VR Gruppeneinteilung'!H25","v":"TuS Weener"},"Tammo Maas"]
[{"$f":"'VR Gruppeneinteilung'!H26","v":"Weiße Elf Nordhorn"},"Ramon Beld"]
[{"$f":"'VR Gruppeneinteilung'!H27","v":"SV Wallinghausen"},"Klaus Szagunn"]
[{"$f":"'VR Gruppeneinteilung'!H28","v":"SF Oesede"},"Hendrick Kuckmeyer"]
[{"$f":"'VR Gruppeneinteilung'!H29","v":"SV Spetzerfehn"},"Paskal de Buhr"]
[{"$f":"'VR Gruppeneinteilung'!H30","v":"SV Concordia Neermoor"},"Sören Janssen"]
[{"$f":"'VR Gruppeneinteilung'!H31","v":"TV Apen"},"Fabian Bahr"]
[null,{"$f":"COUNTA(B3:B32)","v":30}]